{"text_format":"1","workbook":"xlsx","n_sheets":17,"sheets":["Model Instructions","Summary","Target Assumptions","Target IS","Target BS","Target CF","Acquirer Assumptions","Acquirer IS","Acquirer BS","Acquirer CF","Newco Assumptions","Newco IS","Newco BS","Newco CF","Debt Repayment","Options-Convertibles","Valuation"],"not_rendered":{"charts":0,"images":0,"macros":1,"external_links":0,"defined_names":192,"comments":2,"pivot_tables":0},"unopened":[],"bounds":{"document_bytes":16777216,"sheet_cells":100000,"rows_first":2000,"rows_last":500,"rows_between":2000,"halvings":0,"cell_chars":16384,"cell_head_chars":4096},"cells_cut":0,"cells_raw":0,"read":"whole","date_system":"1900"}

{"sheet":"Model Instructions","index":0,"n_rows":1,"n_cols":1,"rows_kept":1,"cut":false,"hidden":false,"merged":[]}
["Model Instructions"]

{"sheet":"Summary","index":1,"n_rows":63,"n_cols":17,"rows_kept":63,"cut":false,"hidden":false,"merged":[[4,1,4,4],[4,7,4,10],[4,13,4,16],[20,13,20,16],[20,1,20,4],[20,7,20,10],[8,13,8,14],[36,1,36,4],[36,7,36,10],[36,13,36,16],[54,13,54,16],[54,7,54,10]]}
[null,"Acquirer",null,null,null,null,null,null,null,null,null,null,null,null,"Transaction Summary"]
[null,"($Millions, except per share data)"]
[]
[]
[null,"Transaction Value",null,null,null,null,null,"Form of Payment",null,null,null,null,null,"Sources & Uses"]
[]
[null,"Price Per Share",null,null,82,null,null,"% Stock",null,null,0.5,null,null,"Excess Cash",null,null,1000]
[null,"Target Shares Outstanding",null,null,{"$f":"'Target Assumptions'!H53","v":174.5},null,null,"% Cash",null,null,{"$f":"1-K7","v":0.5},null,null,"Common Shares Issued to Target Shareholders",null,null,{"$f":"E10*K7","v":7247.3824500000001}]
[null,"Dilutive Effect: Stock Options/Security Conv",null,null,{"$f":"'Options-Convertibles'!G16+'Options-Convertibles'!G26+'Options-Convertibles'!N12","v":2.2654256097560972},null,null,null,null,null,null,null,null,"New Common Shares Issued to Public",null,null,4000]
[null,"   Equity Consideration",null,null,{"$f":"E7*(E8+E9)","v":14494.7649},null,null,"Target Preannouncement Share Price",null,null,60.75,null,null,"Convertible Preferred Equity",0,null,0]
{"$rows_left_out":54}
{"sheet":"Target Assumptions","index":2,"n_rows":58,"n_cols":18,"rows_kept":58,"cut":false,"hidden":false,"merged":[]}
["Target",null,null,null,null,null,null,null,null,null,null,null,null,null,null,"          Assumptions"]
["($Millions, except per share data)"]
[]
[]
[null,null,null,"Actual",null,null,null,null,null,"Projections for the Period Ending December 31,"]
[null,null,null,2013,null,{"$f":"D6+1","v":2014},null,{"$f":"F6+1","v":2015},null,{"$f":"H6+1","v":2016},null,{"$f":"J6+1","v":2017},null,{"$f":"L6+1","v":2018},null,{"$f":"N6+1","v":2019},null,{"$f":"P6+1","v":2020}]
[]
[null,"Income Statement"]
[]
[null,"Sales Growth",null,"NA",null,{"$f":"+IF(ISERROR('Target IS'!F9/'Target IS'!D9-1),0,'Target IS'!F9/'Target IS'!D9-1)","v":5.2283938574733124E-2},null,{"$f":"+IF(ISERROR('Target IS'!H9/'Target IS'!F9-1),0,'Target IS'!H9/'Target IS'!F9-1)","v":4.8414863469025571E-2},null,5.5E-2,null,{"$f":"J10","v":5.5E-2},null,{"$f":"L10","v":5.5E-2},null,5.5E-2,null,5.5E-2]
{"$rows_left_out":49}
{"sheet":"Target IS","index":3,"n_rows":57,"n_cols":22,"rows_kept":57,"cut":false,"hidden":false,"merged":[]}
[{"$f":"'Target Assumptions'!A1","v":"Target"},null,null,null,null,null,null,null,null,null,null,null,null,null,null,null,null,null,"Income Statement"]
["($Millions, except per share data)"]
[]
[]
[]
[null,null,null,{"$f":"'Target Assumptions'!D5","v":"Actual"},null,null,null,null,null,{"$f":"'Target Assumptions'!J5","v":"Projections for the Period Ending December 31,"},null,null,null,null,null,null,null,null,null,null,1," 0 = circ off"]
[null,null,null,{"$f":"'Target Assumptions'!D6","v":2013},null,{"$f":"'Target Assumptions'!F6","v":2014},null,{"$f":"'Target Assumptions'!H6","v":2015},null,{"$f":"'Target Assumptions'!J6","v":2016},null,{"$f":"'Target Assumptions'!L6","v":2017},null,{"$f":"'Target Assumptions'!N6","v":2018},null,{"$f":"'Target Assumptions'!P6","v":2019},null,{"$f":"'Target Assumptions'!R6","v":2020},null,null,null," 1 = circ on"]
[]
[null,"Sales",null,3588.1,null,3775.7,null,3958.5,null,{"$f":"H9*(1+'Target Assumptions'!J10)","v":4176.2174999999997},null,{"$f":"J9*(1+'Target Assumptions'!L10)","v":4405.9094624999998},null,{"$f":"L9*(1+'Target Assumptions'!N10)","v":4648.2344829374997},null,{"$f":"N9*(1+'Target Assumptions'!P10)","v":4903.8873794990623},null,{"$f":"P9*(1+'Target Assumptions'!R10)","v":5173.6011853715099}]
[]
{"$rows_left_out":48}
{"sheet":"Target BS","index":4,"n_rows":57,"n_cols":19,"rows_kept":57,"cut":false,"hidden":false,"merged":[]}
[{"$f":"'Target IS'!A1","v":"Target"},null,null,null,null,null,null,null,null,null,null,null,null,null,null,null,null,null,"Balance Sheet"]
["($Millions, except per share data)"]
[]
[]
[]
[null,null,null,{"$f":"'Target IS'!D6","v":"Actual"},null,null,null,null,null,{"$f":"'Target IS'!J6","v":"Projections for the Period Ending December 31,"}]
[null,null,null,{"$f":"'Target IS'!D7","v":2013},null,{"$f":"'Target IS'!F7","v":2014},null,{"$f":"'Target IS'!H7","v":2015},null,{"$f":"'Target IS'!J7","v":2016},null,{"$f":"'Target IS'!L7","v":2017},null,{"$f":"'Target IS'!N7","v":2018},null,{"$f":"'Target IS'!P7","v":2019},null,{"$f":"'Target IS'!R7","v":2020}]
[]
[null,"Cash",null,{"$f":"813.6+23.1+18.2","v":854.90000000000009},187.3,{"$f":"838.8+26.6+16.7","v":882.1},null,{"$f":"255.5+5.7+15.1","v":276.3},null,{"$f":"'Target CF'!J52","v":826.68675493835622},null,{"$f":"'Target CF'!L52","v":1174.263911459966},null,{"$f":"'Target CF'!N52","v":1572.7816948302639},null,{"$f":"'Target CF'!P52","v":2024.9574754555283},null,{"$f":"'Target CF'!R52","v":2533.6745045515663}]
[null,"Accounts Receivable",null,587.5,null,637,null,697.3,null,{"$f":"('Target Assumptions'!J21*'Target IS'!J9)/365","v":675.05981506849309},null,{"$f":"('Target Assumptions'!L21*'Target IS'!L9)/365","v":712.18810489726025},null,{"$f":"('Target Assumptions'!N21*'Target IS'!N9)/365","v":751.35845066660943},null,{"$f":"('Target Assumptions'!P21*'Target IS'!P9)/365","v":792.68316545327309},null,{"$f":"('Target Assumptions'!R21*'Target IS'!R9)/365","v":836.28073955320303}]
{"$rows_left_out":48}
{"sheet":"Target CF","index":5,"n_rows":54,"n_cols":19,"rows_kept":54,"cut":false,"hidden":false,"merged":[[5,5,5,7]]}
[{"$f":"'Target BS'!A1","v":"Target"},null,null,null,null,null,null,null,null,null,null,null,null,null,null,null,null,null,"Statement of Cash Flow"]
["($Millions, except per share data)"]
[]
[]
[]
[null,null,null,null,null,{"$f":"'Target BS'!D6","v":"Actual"},null,null,null,{"$f":"'Target BS'!J6","v":"Projections for the Period Ending December 31,"}]
[null,null,null,null,null,{"$f":"'Target BS'!F7","v":2014},null,{"$f":"'Target BS'!H7","v":2015},null,{"$f":"'Target BS'!J7","v":2016},null,{"$f":"'Target BS'!L7","v":2017},null,{"$f":"'Target BS'!N7","v":2018},null,{"$f":"'Target BS'!P7","v":2019},null,{"$f":"'Target BS'!R7","v":2020}]
[]
[null,"Net Income",null,null,null,{"$f":"'Target IS'!F38","v":-58.999999999999815},null,{"$f":"'Target IS'!H38","v":161.9000000000002},null,{"$f":"'Target IS'!J38","v":177.05525400000022},null,{"$f":"'Target IS'!L38","v":218.71733397000011},null,{"$f":"'Target IS'!N38","v":262.57067057834985},null,{"$f":"'Target IS'!P38","v":308.75157662975926},null,{"$f":"'Target IS'!R38","v":357.40449388077991}]
[]
{"$rows_left_out":45}
{"sheet":"Acquirer Assumptions","index":6,"n_rows":59,"n_cols":19,"rows_kept":59,"cut":false,"hidden":false,"merged":[]}
["Acquirer",null,null,null,null,null,null,null,null,null,null,null,null,null,null,null,null,null,"Assumptions"]
[null,"($Millions, except per share data)"]
[]
[]
[]
[null,null,null,"Actual",null,null,null,null,null,"Projections for the Period Ending December 31,"]
[null,null,null,2013,null,{"$f":"D7+1","v":2014},null,{"$f":"F7+1","v":2015},null,{"$f":"H7+1","v":2016},null,{"$f":"J7+1","v":2017},null,{"$f":"L7+1","v":2018},null,{"$f":"N7+1","v":2019},null,{"$f":"P7+1","v":2020}]
[]
[null,"Income Statement"]
[]
{"$rows_left_out":50}
{"sheet":"Acquirer IS","index":7,"n_rows":57,"n_cols":22,"rows_kept":57,"cut":false,"hidden":false,"merged":[]}
[{"$f":"'Acquirer Assumptions'!A1","v":"Acquirer"},null,null,null,null,null,null,null,null,null,null,null,null,null,null,null,null,null,"Income Statement"]
["($Millions except per share data)"]
[]
[]
[]
[null,null,null,{"$f":"'Acquirer Assumptions'!D6","v":"Actual"},null,null,null,null,null,{"$f":"'Acquirer Assumptions'!J6","v":"Projections for the Period Ending December 31,"},null,null,null,null,null,null,null,null,null,null,1," 0 = circ off"]
[null,null,null,{"$f":"'Acquirer Assumptions'!D7","v":2013},null,{"$f":"'Acquirer Assumptions'!F7","v":2014},null,{"$f":"'Acquirer Assumptions'!H7","v":2015},null,{"$f":"'Acquirer Assumptions'!J7","v":2016},null,{"$f":"'Acquirer Assumptions'!L7","v":2017},null,{"$f":"'Acquirer Assumptions'!N7","v":2018},null,{"$f":"'Acquirer Assumptions'!P7","v":2019},null,{"$f":"'Acquirer Assumptions'!R7","v":2020},null,null,null," 1 = circ on"]
[]
[null,"Sales",null,10393.1,null,11558.8,null,12509.9,null,{"$f":"H9*(1+'Acquirer Assumptions'!J11)","v":13160.4148},null,{"$f":"J9*(1+'Acquirer Assumptions'!L11)","v":13844.756369600002},null,{"$f":"L9*(1+'Acquirer Assumptions'!N11)","v":14564.683700819201},null,{"$f":"N9*(1+'Acquirer Assumptions'!P11)","v":15322.047253261801},null,{"$f":"P9*(1+'Acquirer Assumptions'!R11)","v":16118.793710431415}]
[]
{"$rows_left_out":48}
{"sheet":"Acquirer BS","index":8,"n_rows":57,"n_cols":19,"rows_kept":57,"cut":false,"hidden":false,"merged":[]}
[{"$f":"'Acquirer Assumptions'!A1","v":"Acquirer"},null,null,null,null,null,null,null,null,null,null,null,null,null,null,null,null,null,"Balance Sheet"]
["($Millions, except per share data)"]
[]
[]
[]
[null,null,null,{"$f":"'Acquirer IS'!D6","v":"Actual"},null,null,null,null,null,{"$f":"'Acquirer IS'!J6","v":"Projections for the Period Ending December 31,"}]
[null,null,null,{"$f":"'Acquirer IS'!D7","v":2013},null,{"$f":"'Acquirer IS'!F7","v":2014},null,{"$f":"'Acquirer IS'!H7","v":2015},null,{"$f":"'Acquirer IS'!J7","v":2016},null,{"$f":"'Acquirer IS'!L7","v":2017},null,{"$f":"'Acquirer IS'!N7","v":2018},null,{"$f":"'Acquirer IS'!P7","v":2019},null,{"$f":"'Acquirer IS'!R7","v":2020}]
[]
[null,"Cash and ST Investments",null,{"$f":"917.8+8.7","v":926.5},null,{"$f":"1016.3+4.3","v":1020.5999999999999},null,{"$f":"851+4.3","v":855.3},null,{"$f":"'Acquirer CF'!J50","v":1041.2686571260274},null,{"$f":"'Acquirer CF'!L50","v":955.77423147858167},null,{"$f":"'Acquirer CF'!N50","v":833.44340012208772},null,{"$f":"'Acquirer CF'!P50","v":665.23350013401864},null,{"$f":"'Acquirer CF'!R50","v":441.14460170365101}]
[null,"Accounts Receivable",null,1473.9,null,1763.7,null,1804.9,null,{"$f":"('Acquirer Assumptions'!J22*'Acquirer IS'!J9)/365","v":1838.8524789041096},null,{"$f":"('Acquirer Assumptions'!L22*'Acquirer IS'!L9)/365","v":1934.4728078071234},null,{"$f":"('Acquirer Assumptions'!N22*'Acquirer IS'!N9)/365","v":2035.0653938130938},null,{"$f":"('Acquirer Assumptions'!P22*'Acquirer IS'!P9)/365","v":2140.8887942913748},null,{"$f":"('Acquirer Assumptions'!R22*'Acquirer IS'!R9)/365","v":2252.2150115945265}]
{"$rows_left_out":48}
{"sheet":"Acquirer CF","index":9,"n_rows":52,"n_cols":19,"rows_kept":52,"cut":false,"hidden":false,"merged":[]}
[{"$f":"'Acquirer Assumptions'!A1","v":"Acquirer"},null,null,null,null,null,null,null,null,null,null,null,null,null,null,null,null,null,"Statement of Cash Flow"]
["($Millions, except per share data)"]
[]
[null,null,null,null,null,{"$f":"'Acquirer BS'!D6","v":"Actual"},null,null,null,{"$f":"'Acquirer BS'!J6","v":"Projections for the Period Ending December 31,"}]
[null,null,null,null,null,{"$f":"'Acquirer BS'!F7","v":2014},null,{"$f":"'Acquirer BS'!H7","v":2015},null,{"$f":"'Acquirer BS'!J7","v":2016},null,{"$f":"'Acquirer BS'!L7","v":2017},null,{"$f":"'Acquirer BS'!N7","v":2018},null,{"$f":"'Acquirer BS'!P7","v":2019},null,{"$f":"'Acquirer BS'!R7","v":2020}]
[]
[null,"Net Income",null,null,null,{"$f":"'Acquirer IS'!F38","v":232.19999999999982},null,{"$f":"'Acquirer IS'!H38","v":-76.600000000000364},null,{"$f":"'Acquirer IS'!J38","v":186.72837064000015},null,{"$f":"'Acquirer IS'!L38","v":155.65893145528128},null,{"$f":"'Acquirer IS'!N38","v":116.29810031557417},null,{"$f":"'Acquirer IS'!P38","v":67.763336130946797},null,{"$f":"'Acquirer IS'!R38","v":9.0905459668371655}]
[]
[null,"Depreciation & Amortization",null,null,null,{"$f":"'Acquirer IS'!F46","v":895.6},null,{"$f":"'Acquirer IS'!H46","v":983.7},null,{"$f":"'Acquirer IS'!J46","v":987.03111000000001},null,{"$f":"'Acquirer IS'!L46","v":1038.35672772},null,{"$f":"'Acquirer IS'!N46","v":1092.3512775614402},null,{"$f":"'Acquirer IS'!P46","v":1149.1535439946349},null,{"$f":"'Acquirer IS'!R46","v":1208.9095282823562}]
[]
{"$rows_left_out":43}
{"sheet":"Newco Assumptions","index":10,"n_rows":59,"n_cols":19,"rows_kept":59,"cut":false,"hidden":false,"merged":[]}
["Newco",null,null,null,null,null,null,null,null,null,null,null,null,null,null,null,null,null,"Assumptions"]
["($Millions except per share data)"]
[]
[]
[]
[null,null,null,"Actual",null,null,null,null,null,"Projections"]
[null,null,null,2013,null,{"$f":"D7+1","v":2014},null,{"$f":"F7+1","v":2015},null,{"$f":"H7+1","v":2016},null,{"$f":"J7+1","v":2017},null,{"$f":"L7+1","v":2018},null,{"$f":"N7+1","v":2019},null,{"$f":"P7+1","v":2020}]
[]
[null,"Income Statement"]
[]
{"$rows_left_out":50}
{"sheet":"Newco IS","index":11,"n_rows":58,"n_cols":26,"rows_kept":58,"cut":false,"hidden":false,"merged":[]}
[{"$f":"'Newco Assumptions'!A1","v":"Newco"},null,null,null,null,null,null,null,null,null,null,null,null,null,null,null,null,null,null,null,null,null,"Pro Forma Income Statement"]
["($Millions, except per share data)"]
[]
[]
[]
[null,null,null,"Actual",null,null,{"$f":"\"Projected \"&('Newco Assumptions'!J7)&\"\"","v":"Projected 2016"},null,null,null,"Trans",null,"Pro Forma",null,null,{"$f":"'Newco Assumptions'!J6","v":"Projections"},null,null,null,null,null,null,null,null,1," 0 = circ off"]
[null,null,null,{"$f":"'Acquirer Assumptions'!H7","v":2015},null,null,{"$f":"'Acquirer Assumptions'!A1","v":"Acquirer"},null,"Target",null,"Adj",null,{"$f":"'Newco Assumptions'!J7","v":2016},null,null,{"$f":"'Acquirer Assumptions'!L7","v":2017},null,{"$f":"'Acquirer Assumptions'!N7","v":2018},null,{"$f":"'Acquirer Assumptions'!P7","v":2019},null,{"$f":"'Acquirer Assumptions'!R7","v":2020},null,null,null," 1 = circ on"]
[]
[null,"Sales",null,{"$f":"'Acquirer IS'!H9","v":12509.9},null,null,{"$f":"'Acquirer IS'!J9","v":13160.4148},null,{"$f":"'Target IS'!J9","v":4176.2174999999997},null,{"$f":"Summary!Q39","v":25},null,{"$f":"G9+I9+K9","v":17361.632300000001},null,null,{"$f":"'Target IS'!L9+'Acquirer IS'!L9+Summary!Q40","v":18325.6658321},null,{"$f":"'Target IS'!N9+'Acquirer IS'!N9+Summary!Q41","v":19362.918183756701},null,{"$f":"'Target IS'!P9+'Acquirer IS'!P9+Summary!Q42","v":20375.934632760862},null,{"$f":"'Target IS'!R9+'Acquirer IS'!R9+Summary!Q43","v":21442.394895802925}]
[]
{"$rows_left_out":49}
{"sheet":"Newco BS","index":12,"n_rows":59,"n_cols":25,"rows_kept":59,"cut":false,"hidden":false,"merged":[]}
[{"$f":"'Newco IS'!A1","v":"Newco"},null,null,null,null,null,null,null,null,null,null,null,null,null,null,null,null,null,null,null,null,null,null,null,"Pro Forma Balance Sheet"]
["($Millions, except per share data)"]
[]
[]
[]
[null,null,null,null,{"$f":"\"Actual \"&('Newco Assumptions'!H7)&\"\"","v":"Actual 2015"},null,null,null,"Pre-Trans",null,"Trans",null,"Pro Forma",null,null,{"$f":"'Newco IS'!P6","v":"Projections"}]
[null,null,null,null,{"$f":"'Acquirer IS'!A1","v":"Acquirer"},null,"Target",null,"Adj",null,"Adj",null,{"$f":"'Newco Assumptions'!H7","v":2015},null,null,{"$f":"'Acquirer IS'!J7","v":2016},null,{"$f":"'Acquirer IS'!L7","v":2017},null,{"$f":"'Acquirer IS'!N7","v":2018},null,{"$f":"'Acquirer IS'!P7","v":2019},null,{"$f":"'Acquirer IS'!R7","v":2020}]
[]
[null,"Cash",null,null,{"$f":"'Acquirer BS'!H9","v":855.3},null,{"$f":"'Target BS'!H9","v":276.3},null,null,null,{"$f":"-Summary!Q7","v":-1000},null,{"$f":"E9+G9+I9+K9","v":131.59999999999991},null,null,{"$f":"+IF(ISERROR('Newco CF'!J52),0,'Newco CF'!J52)","v":1762.8753582411905},null,{"$f":"'Newco CF'!L52","v":1731.6359684178863},null,{"$f":"'Newco CF'!N52","v":1840.3584981126971},null,{"$f":"'Newco CF'!P52","v":2003.7335811090932},null,{"$f":"'Newco CF'!R52","v":2194.9065641152374}]
[null,"Accounts Receivable",null,null,{"$f":"'Acquirer BS'!H10","v":1804.9},null,{"$f":"'Target BS'!H10","v":697.3},null,null,null,null,null,{"$f":"E10+G10+I10+K10","v":2502.1999999999998},null,null,{"$f":"('Newco Assumptions'!J23*'Newco IS'!M9)/365","v":2517.5374390562488},null,{"$f":"('Newco Assumptions'!L23*'Newco IS'!P9)/365","v":2657.5372045766339},null,{"$f":"('Newco Assumptions'!N23*'Newco IS'!R9)/365","v":2808.1781439918573},null,{"$f":"('Newco Assumptions'!P23*'Newco IS'!T9)/365","v":2955.3279775480942},null,{"$f":"('Newco Assumptions'!R23*'Newco IS'!V9)/365","v":3110.2534897646983}]
{"$rows_left_out":50}
{"sheet":"Newco CF","index":13,"n_rows":54,"n_cols":19,"rows_kept":54,"cut":false,"hidden":false,"merged":[]}
[{"$f":"'Newco IS'!A1","v":"Newco"},null,null,null,null,null,null,null,null,null,null,null,null,null,null,null,null,null,"Pro Forma Statement of Cash Flow"]
["($Millions, except per share data)"]
[]
[]
[]
[null,null,null,null,null,{"$f":"'Newco Assumptions'!D6","v":"Actual"},null,null,null,{"$f":"'Newco BS'!P6","v":"Projections"}]
[null,null,null,null,null,{"$f":"'Acquirer BS'!F7","v":2014},null,{"$f":"'Acquirer BS'!H7","v":2015},null,{"$f":"'Acquirer BS'!J7","v":2016},null,{"$f":"'Acquirer BS'!L7","v":2017},null,{"$f":"'Acquirer BS'!N7","v":2018},null,{"$f":"'Acquirer BS'!P7","v":2019},null,{"$f":"'Acquirer BS'!R7","v":2020}]
[]
[null,"Net Income",null,null,null,{"$f":"'Acquirer CF'!F7","v":232.19999999999982},null,{"$f":"'Acquirer CF'!H7","v":-76.600000000000364},null,{"$f":"'Newco IS'!M39","v":-239.98527402761266},null,{"$f":"'Newco IS'!P39","v":279.64452373625784},null,{"$f":"'Newco IS'!R39","v":405.14816562980405},null,{"$f":"'Newco IS'!T39","v":424.02515254850243},null,{"$f":"'Newco IS'!V39","v":435.81315649461595}]
[]
{"$rows_left_out":45}
{"sheet":"Debt Repayment","index":14,"n_rows":52,"n_cols":20,"rows_kept":52,"cut":false,"hidden":false,"merged":[]}
[{"$f":"'Newco Assumptions'!A1","v":"Newco"},null,null,null,null,null,null,null,null,null,null,null,null,null,null,null,"Debt Repayment Schedule"]
["($ in millions except per share figures)"]
[]
[null,null,null,null,null,"Actual",null,{"$f":"'Newco BS'!P6","v":"Projections"}]
[null,"Principal Payments",null,null,null,{"$f":"'Newco BS'!M7","v":2015},null,{"$f":"F5+1","v":2016},null,{"$f":"H5+1","v":2017},null,{"$f":"J5+1","v":2018},null,{"$f":"L5+1","v":2019},null,{"$f":"N5+1","v":2020}]
[]
[null,{"$f":"'Acquirer Assumptions'!A1","v":"Acquirer"}]
[]
[null,"Revolving Credit Facility",null,null,null,0,null,0,null,0,null,0,null,0,null,0]
[null,"Senior Debt",null,null,null,{"$f":"'Acquirer Assumptions'!H39","v":354.5},null,{"$f":"'Acquirer Assumptions'!J39","v":500},null,{"$f":"'Acquirer Assumptions'!L39","v":500},null,{"$f":"'Acquirer Assumptions'!N39","v":500},null,{"$f":"'Acquirer Assumptions'!P39","v":500},null,{"$f":"'Acquirer Assumptions'!R39","v":500}]
{"$rows_left_out":43}
{"sheet":"Options-Convertibles","index":15,"n_rows":26,"n_cols":14,"rows_kept":26,"cut":false,"hidden":false,"merged":[[3,1,3,6],[3,8,3,13],[17,1,17,6],[4,1,4,2],[14,2,14,5],[15,2,15,4],[13,2,13,5]]}
[null,"Target","Options-Convertible Securities Analysis"]
[]
[]
[null,"Target Options Schedule",null,null,null,null,null,null,"Target Convertible Preferred Schedule"]
[null,"Potential Options:",null,"Strike","In the $","Include","Proceeds",null,"Balance","Par Value","CV Ratio","CV Price","Convert","Shares"]
[null,null,4.0449999999999999,37.46,{"$f":"IF(D6<Summary!$E$7,\"Yes\",\"No\")","v":"Yes"},{"$f":"IF(E6=\"Yes\",C6,\"No\")","v":4.0449999999999999},{"$f":"D6*F6","v":151.5257},null,3.4,100,1.75,{"$f":"J6/K6","v":57.142857142857146},{"$f":"IF(L6<Summary!$E$7,\"Yes\",\"No\")","v":"Yes"},{"$f":"I6/J6*K6","v":5.9500000000000004E-2}]
[null,null,0,0,{"$f":"IF(D7<Summary!$E$7,\"Yes\",\"No\")","v":"Yes"},{"$f":"IF(E7=\"Yes\",C7,\"No\")","v":0},{"$f":"D7*F7","v":0},null,0,100,0,0,{"$f":"IF(L7<Summary!$E$7,\"Yes\",\"No\")","v":"Yes"},{"$f":"I7/J7*K7","v":0}]
[null,null,0,0,{"$f":"IF(D8<Summary!$E$7,\"Yes\",\"No\")","v":"Yes"},0,0,null,0,100,0,0,{"$f":"IF(L8<Summary!$E$7,\"Yes\",\"No\")","v":"Yes"},0]
[null,null,0,0,{"$f":"IF(D9<Summary!$E$7,\"Yes\",\"No\")","v":"Yes"},0,0,null,0,100,0,0,{"$f":"IF(L9<Summary!$E$7,\"Yes\",\"No\")","v":"Yes"},0]
[null,null,0,0,{"$f":"IF(D10<Summary!$E$7,\"Yes\",\"No\")","v":"Yes"},0,0,null,0,100,0,0,{"$f":"IF(L10<Summary!$E$7,\"Yes\",\"No\")","v":"Yes"},0]
{"$rows_left_out":17}
{"sheet":"Valuation","index":16,"n_rows":79,"n_cols":16,"rows_kept":79,"cut":false,"hidden":false,"merged":[[25,9,25,10],[57,1,57,2],[29,1,29,2],[6,9,6,10],[24,9,24,10],[43,9,43,15],[41,9,41,15],[42,9,42,15],[7,1,7,2],[6,1,6,2],[8,1,8,2],[19,1,19,2],[7,9,7,10],[8,9,8,10],[19,9,19,10],[24,1,24,2],[25,1,25,2],[69,1,69,5],[32,1,32,2],[33,1,33,2],[58,1,58,2],[40,1,40,2],[41,1,41,2],[42,1,42,2],[55,9,55,15],[54,9,54,15],[32,9,32,10],[33,9,33,10],[50,9,50,15],[44,9,44,15],[48,9,48,15],[49,9,49,15],[37,9,37,15]]}
[null,"Valuation"]
[]
[null,"Target",null,2016,{"$f":"D3+1","v":2017},{"$f":"E3+1","v":2018},2019,2020,null,"Acquirer",null,2016,{"$f":"L3+1","v":2017},{"$f":"M3+1","v":2018},2019,2020]
[null,"Free Cash Flow",null,null,null,null,null,null,null,"Free Cash Flow"]
[null,"EBIT",null,{"$f":"'Target IS'!J20","v":390.6370900000004},{"$f":"'Target IS'!L20","v":445.07388995000019},{"$f":"'Target IS'!N20","v":503.1627842972498},{"$f":"'Target IS'!P20","v":565.13096104959868},{"$f":"'Target IS'!R20","v":631.21915646796651},null,"EBIT",null,{"$f":"'Acquirer IS'!J20","v":591.3956360000002},{"$f":"'Acquirer IS'!L20","v":524.40990737200173},{"$f":"'Acquirer IS'!N20","v":446.21959502104619},{"$f":"'Acquirer IS'!P20","v":355.63207585263081},{"$f":"'Acquirer IS'!R20","v":251.34452157680698}]
[null,"Less: Taxes",null,{"$f":"D5*'Target Assumptions'!J47","v":156.25483600000018},{"$f":"E5*'Target Assumptions'!L47","v":178.02955598000008},{"$f":"F5*'Target Assumptions'!N47","v":201.26511371889993},{"$f":"G5*'Target Assumptions'!P47","v":226.05238441983948},{"$f":"H5*'Target Assumptions'!R47","v":252.48766258718661},null,"Less: Taxes",null,{"$f":"L5*'Acquirer Assumptions'!J49","v":236.5582544000001},{"$f":"M5*'Acquirer Assumptions'!L49","v":209.7639629488007},{"$f":"N5*'Acquirer Assumptions'!N49","v":178.48783800841849},{"$f":"O5*'Acquirer Assumptions'!P49","v":142.25283034105232},{"$f":"P5*'Acquirer Assumptions'!R49","v":100.53780863072279}]
[null,"Plus: Deprec. & Amort..",null,{"$f":"'Target IS'!J17+'Target IS'!J18","v":433.63896},{"$f":"'Target IS'!L17+'Target IS'!L18","v":440.98910279999996},{"$f":"'Target IS'!N17+'Target IS'!N18","v":448.74350345400001},{"$f":"'Target IS'!P17+'Target IS'!P18","v":456.92439614397},{"$f":"'Target IS'!R17+'Target IS'!R18","v":465.55523793188831},null,"Plus: Deprec. & Amort.",null,{"$f":"'Acquirer IS'!J17+'Acquirer IS'!J18","v":987.03111000000001},{"$f":"'Acquirer IS'!L17+'Acquirer IS'!L18","v":1038.35672772},{"$f":"'Acquirer IS'!N17+'Acquirer IS'!N18","v":1092.3512775614402},{"$f":"'Acquirer IS'!P17+'Acquirer IS'!P18","v":1149.1535439946349},{"$f":"'Acquirer IS'!R17+'Acquirer IS'!R18","v":1208.9095282823562}]
[null,"Less: Gross Capex",null,{"$f":"-'Target CF'!J29","v":16.70487},{"$f":"-'Target CF'!L29","v":17.623637849999998},{"$f":"-'Target CF'!N29","v":18.592937931750001},{"$f":"-'Target CF'!P29","v":19.61554951799625},{"$f":"-'Target CF'!R29","v":20.694404741486039},null,"Less: Gross Capex",null,{"$f":"-'Acquirer CF'!J31","v":855.426962},{"$f":"-'Acquirer CF'!L27","v":899.90916402400012},{"$f":"-'Acquirer CF'!N31","v":946.70444055324811},{"$f":"-'Acquirer CF'!P27","v":995.9330714620171},{"$f":"-'Acquirer CF'!R31","v":1047.721591178042}]
[null,"Less: ∆ NWC",null,{"$f":"'Target CF'!J17+'Target CF'!J18+'Target CF'!J20+'Target CF'!J23+'Target CF'!J25","v":22.663376438356181},{"$f":"'Target CF'!L17+'Target CF'!L18+'Target CF'!L20+'Target CF'!L23+'Target CF'!L25","v":-49.034514295890403},{"$f":"'Target CF'!N17+'Target CF'!N18+'Target CF'!N20+'Target CF'!N23+'Target CF'!N25","v":-51.731412582164296},{"$f":"'Target CF'!P17+'Target CF'!P18+'Target CF'!P20+'Target CF'!P23+'Target CF'!P25","v":-54.576640274183546},{"$f":"'Target CF'!R17+'Target CF'!R18+'Target CF'!R20+'Target CF'!R23+'Target CF'!R25","v":-57.578355489263373},null,"Less:  ∆ NWC",null,{"$f":"'Acquirer CF'!J15+'Acquirer CF'!J16+'Acquirer CF'!J18+'Acquirer CF'!J21+'Acquirer CF'!J22+'Acquirer CF'!J23","v":197.27605652602733},{"$f":"'Acquirer CF'!L15+'Acquirer CF'!L16+'Acquirer CF'!L18+'Acquirer CF'!L21+'Acquirer CF'!L22+'Acquirer CF'!L23","v":74.069154939353439},{"$f":"'Acquirer CF'!N15+'Acquirer CF'!N16+'Acquirer CF'!N18+'Acquirer CF'!N21+'Acquirer CF'!N22+'Acquirer CF'!N2","v":66.985150996199991},{"$f":"'Acquirer CF'!P15+'Acquirer CF'!P16+'Acquirer CF'!P18+'Acquirer CF'!P21+'Acquirer CF'!P22+'Acquirer CF'!P23","v":59.532778848002295},{"$f":"'Acquirer CF'!R15+'Acquirer CF'!R16+'Acquirer CF'!R18+'Acquirer CF'!R21+'Acquirer CF'!R22+'Acquirer CF'!R23","v":51.692883348098235}]
[null,"Equals: Free Cash Flow",null,{"$f":"SUM(D5:D9)","v":1019.8991324383568},{"$f":"SUM(E5:E9)","v":1032.6816722841097},1120.0329268197354,1213.1466508572207,1312.3781062392641,null,"Equals: Free Cash Flow",null,{"$f":"SUM(L5:L9)","v":2867.6880189260278},{"$f":"SUM(M5:M9)","v":2746.5089170041556},2730.7483021403532,2702.5043004983377,2660.2063330160263]
{"$rows_left_out":69}