{"text_format":"1","workbook":"xlsx","n_sheets":6,"sheets":["Model Instructions","Target Assumptions","Target IS","Target BS","Target CF","Valuation"],"not_rendered":{"charts":0,"images":0,"macros":1,"external_links":0,"defined_names":153,"comments":1,"pivot_tables":0},"unopened":[],"bounds":{"document_bytes":16777216,"sheet_cells":100000,"rows_first":2000,"rows_last":500,"rows_between":2000,"halvings":0,"cell_chars":16384,"cell_head_chars":4096},"cells_cut":0,"cells_raw":0,"read":"whole","date_system":"1900"}

{"sheet":"Model Instructions","index":0,"n_rows":1,"n_cols":1,"rows_kept":1,"cut":false,"hidden":false,"merged":[]}
["Model Instructions"]

{"sheet":"Target Assumptions","index":1,"n_rows":58,"n_cols":18,"rows_kept":58,"cut":false,"hidden":false,"merged":[]}
["Target",null,null,null,null,null,null,null,null,null,null,null,null,null,null,"          Assumptions"]
["($Millions, except per share data)"]
[]
[]
[null,null,null,"Actual",null,null,null,null,null,"Projections for the Period Ending December 31,"]
[null,null,null,2011,null,{"$f":"D6+1","v":2012},null,{"$f":"F6+1","v":2013},null,{"$f":"H6+1","v":2014},null,{"$f":"J6+1","v":2015},null,{"$f":"L6+1","v":2016},null,{"$f":"N6+1","v":2017},null,{"$f":"P6+1","v":2018}]
[]
[null,"Income Statement"]
[]
[null,"Sales Growth",null,"NA",null,{"$f":"+IF(ISERROR('Target IS'!F9/'Target IS'!D9-1),0,'Target IS'!F9/'Target IS'!D9-1)","v":5.2283938574733124E-2},null,{"$f":"+IF(ISERROR('Target IS'!H9/'Target IS'!F9-1),0,'Target IS'!H9/'Target IS'!F9-1)","v":4.8414863469025571E-2},null,5.5E-2,null,{"$f":"J10","v":5.5E-2},null,{"$f":"L10","v":5.5E-2},null,5.5E-2,null,5.5E-2]
[null,"COGS as a % of Sales",null,{"$f":"+IF(ISERROR('Target IS'!D11/'Target IS'!D9),0,'Target IS'!D11/'Target IS'!D9)","v":0.41303196677907528},{"$f":"+IF(ISERROR('Target IS'!E11/'Target IS'!E9),0,'Target IS'!E11/'Target IS'!E9)","v":0},{"$f":"+IF(ISERROR('Target IS'!F11/'Target IS'!F9),0,'Target IS'!F11/'Target IS'!F9)","v":0.44116322801070001},{"$f":"+IF(ISERROR('Target IS'!G11/'Target IS'!G9),0,'Target IS'!G11/'Target IS'!G9)","v":0},{"$f":"+IF(ISERROR('Target IS'!H11/'Target IS'!H9),0,'Target IS'!H11/'Target IS'!H9)","v":0.42038651004168243},null,0.43,null,{"$f":"J11","v":0.43},null,{"$f":"L11","v":0.43},null,0.43,null,0.43]
[null,"SG&A % annual increase (decrease)",null,"NA",null,{"$f":"+IF(ISERROR('Target IS'!F15/'Target IS'!D15-1),0,'Target IS'!F15/'Target IS'!D15-1)","v":-1.3878029710711504E-2},null,{"$f":"+IF(ISERROR('Target IS'!H15/'Target IS'!F15-1),0,'Target IS'!H15/'Target IS'!F15-1)","v":4.5193260654112999E-2},null,0.04,null,0.04,null,0.04,null,0.04,null,0.04]
[null,"Other Operating Expense as a % of Sales",null,{"$f":"+IF(ISERROR('Target IS'!D16/'Target IS'!D9),0,'Target IS'!D16/'Target IS'!D9)","v":0.13118363479278727},{"$f":"+IF(ISERROR('Target IS'!E16/'Target IS'!E9),0,'Target IS'!E16/'Target IS'!E9)","v":0},{"$f":"+IF(ISERROR('Target IS'!F16/'Target IS'!F9),0,'Target IS'!F16/'Target IS'!F9)","v":0.12003072277988187},{"$f":"+IF(ISERROR('Target IS'!G16/'Target IS'!G9),0,'Target IS'!G16/'Target IS'!G9)","v":0},{"$f":"+IF(ISERROR('Target IS'!H16/'Target IS'!H9),0,'Target IS'!H16/'Target IS'!H9)","v":0.10473664266767714},null,0.11,null,0.11,null,0.11,null,0.11,null,0.11]
[null,"Income from Affiliates Growth",null,"NA",null,{"$f":"IF('Target IS'!D23=0,0,'Target IS'!F23/'Target IS'!D23-1)","v":0},null,{"$f":"IF('Target IS'!F23=0,0,'Target IS'!H23/'Target IS'!F23-1)","v":0},null,0,null,0,null,{"$f":"L14","v":0},null,{"$f":"N14","v":0},null,{"$f":"P14","v":0}]
[null,"Noncontrolling Interest - % of Earnings",null,{"$f":"+IF(ISERROR('Target IS'!D30/('Target IS'!D28-'Target IS'!D31)),0,'Target IS'!D30/('Target IS'!D28-'Target IS'!D31))","v":0},{"$f":"+IF(ISERROR('Target IS'!E30/('Target IS'!E28-'Target IS'!E31)),0,'Target IS'!E30/('Target IS'!E28-'Target IS'!E31))","v":0},{"$f":"+IF(ISERROR('Target IS'!F30/('Target IS'!F28-'Target IS'!F31)),0,'Target IS'!F30/('Target IS'!F28-'Target IS'!F31))","v":0},{"$f":"+IF(ISERROR('Target IS'!G30/('Target IS'!G28-'Target IS'!G31)),0,'Target IS'!G30/('Target IS'!G28-'Target IS'!G31))","v":0},{"$f":"+IF(ISERROR('Target IS'!H30/('Target IS'!H28-'Target IS'!H31)),0,'Target IS'!H30/('Target IS'!H28-'Target IS'!H31))","v":0},null,0,null,0,null,{"$f":"L15","v":0},null,{"$f":"N15","v":0},null,{"$f":"P15","v":0}]
[null,"EBITDA Growth",null,"NA",null,{"$f":"+IF(ISERROR('Target IS'!F49/'Target IS'!D49-1),0,'Target IS'!F49/'Target IS'!D49-1)","v":5.8150931068278844E-2},{"$f":"+IF(ISERROR('Target IS'!G49/'Target IS'!E49-1),0,'Target IS'!G49/'Target IS'!E49-1)","v":0},{"$f":"+IF(ISERROR('Target IS'!H49/'Target IS'!F49-1),0,'Target IS'!H49/'Target IS'!F49-1)","v":0.27384995368941012},{"$f":"+IF(ISERROR('Target IS'!I49/'Target IS'!G49-1),0,'Target IS'!I49/'Target IS'!G49-1)","v":0},{"$f":"+IF(ISERROR('Target IS'!J49/'Target IS'!H49-1),0,'Target IS'!J49/'Target IS'!H49-1)","v":-1.1196679592823111E-3},null,{"$f":"+IF(ISERROR('Target IS'!L49/'Target IS'!J49-1),0,'Target IS'!L49/'Target IS'!J49-1)","v":7.4959041634170553E-2},null,{"$f":"+IF(ISERROR('Target IS'!N49/'Target IS'!L49-1),0,'Target IS'!N49/'Target IS'!L49-1)","v":7.4309948096237921E-2},null,{"$f":"+IF(ISERROR('Target IS'!P49/'Target IS'!N49-1),0,'Target IS'!P49/'Target IS'!N49-1)","v":7.3693251473353039E-2},null,{"$f":"+IF(ISERROR('Target IS'!R49/'Target IS'!P49-1),0,'Target IS'!R49/'Target IS'!P49-1)","v":7.3106644058356096E-2}]
[null,"EBITDA Margin",null,{"$f":"+IF(ISERROR('Target IS'!D49/'Target IS'!D9),0,'Target IS'!D49/'Target IS'!D9)","v":0.17061954795016859},{"$f":"+IF(ISERROR('Target IS'!E49/'Target IS'!E9),0,'Target IS'!E49/'Target IS'!E9)","v":0},{"$f":"+IF(ISERROR('Target IS'!F49/'Target IS'!F9),0,'Target IS'!F49/'Target IS'!F9)","v":0.17157083454723632},{"$f":"+IF(ISERROR('Target IS'!G49/'Target IS'!G9),0,'Target IS'!G49/'Target IS'!G9)","v":0},{"$f":"+IF(ISERROR('Target IS'!H49/'Target IS'!H9),0,'Target IS'!H49/'Target IS'!H9)","v":0.20846280156624988},{"$f":"+IF(ISERROR('Target IS'!I49/'Target IS'!I9),0,'Target IS'!I49/'Target IS'!I9)","v":0},{"$f":"+IF(ISERROR('Target IS'!J49/'Target IS'!J9),0,'Target IS'!J49/'Target IS'!J9)","v":0.19737383170297057},null,{"$f":"+IF(ISERROR('Target IS'!L49/'Target IS'!L9),0,'Target IS'!L49/'Target IS'!L9)","v":0.20110785305316523},null,{"$f":"+IF(ISERROR('Target IS'!N49/'Target IS'!N9),0,'Target IS'!N49/'Target IS'!N9)","v":0.20478878405240925},null,{"$f":"+IF(ISERROR('Target IS'!P49/'Target IS'!P9),0,'Target IS'!P49/'Target IS'!P9)","v":0.20841737953981576},null,{"$f":"+IF(ISERROR('Target IS'!R49/'Target IS'!R9),0,'Target IS'!R49/'Target IS'!R9)","v":0.21199438362218809}]
[]
[null,"Balance Sheet"]
[]
{"$rows_left_out":39}
{"sheet":"Target IS","index":2,"n_rows":57,"n_cols":22,"rows_kept":57,"cut":false,"hidden":false,"merged":[]}
[{"$f":"'Target Assumptions'!A1","v":"Target"},null,null,null,null,null,null,null,null,null,null,null,null,null,null,null,null,null,"Income Statement"]
["($Millions, except per share data)"]
[]
[]
[]
[null,null,null,{"$f":"'Target Assumptions'!D5","v":"Actual"},null,null,null,null,null,{"$f":"'Target Assumptions'!J5","v":"Projections for the Period Ending December 31,"},null,null,null,null,null,null,null,null,null,null,1," 0 = circ off"]
[null,null,null,{"$f":"'Target Assumptions'!D6","v":2011},null,{"$f":"'Target Assumptions'!F6","v":2012},null,{"$f":"'Target Assumptions'!H6","v":2013},null,{"$f":"'Target Assumptions'!J6","v":2014},null,{"$f":"'Target Assumptions'!L6","v":2015},null,{"$f":"'Target Assumptions'!N6","v":2016},null,{"$f":"'Target Assumptions'!P6","v":2017},null,{"$f":"'Target Assumptions'!R6","v":2018},null,null,null," 1 = circ on"]
[]
[null,"Sales",null,3588.1,null,3775.7,null,3958.5,null,{"$f":"H9*(1+'Target Assumptions'!J10)","v":4176.2174999999997},null,{"$f":"J9*(1+'Target Assumptions'!L10)","v":4405.9094624999998},null,{"$f":"L9*(1+'Target Assumptions'!N10)","v":4648.2344829374997},null,{"$f":"N9*(1+'Target Assumptions'!P10)","v":4903.8873794990623},null,{"$f":"P9*(1+'Target Assumptions'!R10)","v":5173.6011853715099}]
[]
[null,"  Cost of Goods Sold",null,{"$f":"1188.2+293.8","v":1482},null,{"$f":"1357+308.7","v":1665.7},null,{"$f":"1372.3+291.8","v":1664.1},null,{"$f":"J9*'Target Assumptions'!J11","v":1795.7735249999998},null,{"$f":"L9*'Target Assumptions'!L11","v":1894.5410688749998},null,{"$f":"N9*'Target Assumptions'!N11","v":1998.7408276631249},null,{"$f":"P9*'Target Assumptions'!P11","v":2108.6715731845966},null,{"$f":"R9*'Target Assumptions'!R11","v":2224.6485097097493}]
[]
[null,"Gross Profit",null,{"$f":"D9-D11","v":2106.1},null,{"$f":"F9-F11","v":2110},null,{"$f":"H9-H11","v":2294.4},null,{"$f":"J9-J11","v":2380.4439750000001},null,{"$f":"L9-L11","v":2511.368393625},null,{"$f":"N9-N11","v":2649.4936552743748},null,{"$f":"P9-P11","v":2795.2158063144657},null,{"$f":"R9-R11","v":2948.9526756617606}]
[]
[null,"  SG&A",null,1023.2,1009,1009,null,1054.5999999999999,null,{"$f":"H15*(1+'Target Assumptions'!J12)","v":1096.7839999999999},null,{"$f":"J15*(1+'Target Assumptions'!L12)","v":1140.65536},null,{"$f":"L15*(1+'Target Assumptions'!N12)","v":1186.2815744},null,{"$f":"N15*(1+'Target Assumptions'!P12)","v":1233.7328373759999},null,{"$f":"P15*(1+'Target Assumptions'!R12)","v":1283.0821508710399}]
[null,"  Other Operating Expense",null,{"$f":"375.5+1.7+93.5","v":470.7},null,{"$f":"377.9+75.3","v":453.2},null,{"$f":"341.9+72.7","v":414.59999999999997},null,{"$f":"J9*'Target Assumptions'!J13","v":459.38392499999998},null,{"$f":"L9*'Target Assumptions'!L13","v":484.650040875},null,{"$f":"N9*'Target Assumptions'!N13","v":511.30579312312494},null,{"$f":"P9*'Target Assumptions'!P13","v":539.42761174489681},null,{"$f":"R9*'Target Assumptions'!R13","v":569.09613039086605}]
[null,"  Depreciation",null,{"$f":"'Target Assumptions'!D34","v":123},{"$f":"'Target Assumptions'!E34","v":0},{"$f":"'Target Assumptions'!F34","v":123.6},null,{"$f":"'Target Assumptions'!H34","v":126},null,{"$f":"'Target Assumptions'!J34","v":133.63896},null,{"$f":"'Target Assumptions'!L34","v":140.98910279999998},null,{"$f":"'Target Assumptions'!N34","v":148.74350345400001},null,{"$f":"'Target Assumptions'!P34","v":156.92439614397},null,{"$f":"'Target Assumptions'!R34","v":165.55523793188831}]
[null,"  Amortization",null,{"$f":"'Target Assumptions'!D36+'Target Assumptions'!D37","v":299.60000000000002},null,{"$f":"'Target Assumptions'!F36+'Target Assumptions'!F37","v":313.89999999999998},null,{"$f":"'Target Assumptions'!H36+'Target Assumptions'!H37","v":302.89999999999998},null,{"$f":"'Target Assumptions'!J36+'Target Assumptions'!J37","v":300},null,{"$f":"'Target Assumptions'!L36+'Target Assumptions'!L37","v":300},null,{"$f":"'Target Assumptions'!N36+'Target Assumptions'!N37","v":300},null,{"$f":"'Target Assumptions'!P36+'Target Assumptions'!P37","v":300},null,{"$f":"'Target Assumptions'!R36+'Target Assumptions'!R37","v":300}]
[]
[null,"EBIT",null,{"$f":"D13-SUM(D15:D18)","v":189.59999999999991},null,{"$f":"F13-SUM(F15:F18)","v":210.30000000000018},null,{"$f":"H13-SUM(H15:H18)","v":396.30000000000018},null,{"$f":"J13-SUM(J15:J18)","v":390.6370900000004},null,{"$f":"L13-SUM(L15:L18)","v":445.07388995000019},null,{"$f":"N13-SUM(N15:N18)","v":503.1627842972498},null,{"$f":"P13-SUM(P15:P18)","v":565.13096104959868},null,{"$f":"R13-SUM(R15:R18)","v":631.21915646796651}]
{"$rows_left_out":38}
{"sheet":"Target BS","index":3,"n_rows":57,"n_cols":19,"rows_kept":57,"cut":false,"hidden":false,"merged":[]}
[{"$f":"'Target IS'!A1","v":"Target"},null,null,null,null,null,null,null,null,null,null,null,null,null,null,null,null,null,"Balance Sheet"]
["($Millions, except per share data)"]
[]
[]
[]
[null,null,null,{"$f":"'Target IS'!D6","v":"Actual"},null,null,null,null,null,{"$f":"'Target IS'!J6","v":"Projections for the Period Ending December 31,"}]
[null,null,null,{"$f":"'Target IS'!D7","v":2011},null,{"$f":"'Target IS'!F7","v":2012},null,{"$f":"'Target IS'!H7","v":2013},null,{"$f":"'Target IS'!J7","v":2014},null,{"$f":"'Target IS'!L7","v":2015},null,{"$f":"'Target IS'!N7","v":2016},null,{"$f":"'Target IS'!P7","v":2017},null,{"$f":"'Target IS'!R7","v":2018}]
[]
[null,"Cash",null,{"$f":"813.6+23.1+18.2","v":854.90000000000009},187.3,{"$f":"838.8+26.6+16.7","v":882.1},null,{"$f":"255.5+5.7+15.1","v":276.3},null,{"$f":"'Target CF'!J52","v":826.68675493835622},null,{"$f":"'Target CF'!L52","v":1174.263911459966},null,{"$f":"'Target CF'!N52","v":1572.7816948302639},null,{"$f":"'Target CF'!P52","v":2024.9574754555283},null,{"$f":"'Target CF'!R52","v":2533.6745045515663}]
[null,"Accounts Receivable",null,587.5,null,637,null,697.3,null,{"$f":"('Target Assumptions'!J21*'Target IS'!J9)/365","v":675.05981506849309},null,{"$f":"('Target Assumptions'!L21*'Target IS'!L9)/365","v":712.18810489726025},null,{"$f":"('Target Assumptions'!N21*'Target IS'!N9)/365","v":751.35845066660943},null,{"$f":"('Target Assumptions'!P21*'Target IS'!P9)/365","v":792.68316545327309},null,{"$f":"('Target Assumptions'!R21*'Target IS'!R9)/365","v":836.28073955320303}]
[null,"Inventory",null,323.10000000000002,null,377.9,null,403.5,null,{"$f":"('Target Assumptions'!J22*'Target IS'!J11)/365","v":413.27390712328764},null,{"$f":"('Target Assumptions'!L22*'Target IS'!L11)/365","v":436.00397201506843},null,{"$f":"('Target Assumptions'!N22*'Target IS'!N11)/365","v":459.98419047589726},null,{"$f":"('Target Assumptions'!P22*'Target IS'!P11)/365","v":485.28332095207156},null,{"$f":"('Target Assumptions'!R22*'Target IS'!R11)/365","v":511.97390360443546}]
[null,"Other",null,{"$f":"91+190","v":281},null,{"$f":"40.1+156.5","v":196.6},null,{"$f":"105.4+142.7","v":248.1},null,{"$f":"'Target IS'!J9*'Target Assumptions'!J23","v":229.69196249999999},null,{"$f":"'Target IS'!L9*'Target Assumptions'!L23","v":242.3250204375},null,{"$f":"'Target IS'!N9*'Target Assumptions'!N23","v":255.65289656156247},null,{"$f":"'Target IS'!P9*'Target Assumptions'!P23","v":269.7138058724484},null,{"$f":"'Target IS'!R9*'Target Assumptions'!R23","v":284.54806519543303}]
[]
[null,"  Current Assets",null,{"$f":"SUM(D9:D12)","v":2046.5},null,{"$f":"SUM(F9:F12)","v":2093.6},null,{"$f":"SUM(H9:H12)","v":1625.1999999999998},null,{"$f":"SUM(J9:J12)","v":2144.7124396301369},null,{"$f":"SUM(L9:L12)","v":2564.7810088097945},null,{"$f":"SUM(N9:N12)","v":3039.7772325343331},null,{"$f":"SUM(P9:P12)","v":3572.6377677333212},null,{"$f":"SUM(R9:R12)","v":4166.4772129046378}]
[]
[null,"Property, Plant, & Equipment",null,{"$f":"22.4+848","v":870.4},null,{"$f":"25+833.7","v":858.7},null,{"$f":"844.7+26.7","v":871.40000000000009},null,{"$f":"H16+'Target Assumptions'!J32","v":888.10487000000012},null,{"$f":"J16+'Target Assumptions'!L32","v":905.72850785000014},null,{"$f":"L16+'Target Assumptions'!N32","v":924.32144578175019},null,{"$f":"N16+'Target Assumptions'!P32","v":943.9369952997464},null,{"$f":"P16+'Target Assumptions'!R32","v":964.63140004123238}]
[null,"Accumulated Depreciation",null,0,null,0,null,0,null,{"$f":"H17-'Target Assumptions'!J34","v":-133.63896},null,{"$f":"J17-'Target Assumptions'!L34","v":-274.62806279999995},null,{"$f":"L17-'Target Assumptions'!N34","v":-423.37156625399996},null,{"$f":"N17-'Target Assumptions'!P34","v":-580.29596239797002},null,{"$f":"P17-'Target Assumptions'!R34","v":-745.85120032985833}]
[]
[null,"  Net Property, Plant, & Equipment",null,{"$f":"SUM(D16:D17)","v":870.4},null,{"$f":"SUM(F16:F17)","v":858.7},null,{"$f":"SUM(H16:H17)","v":871.40000000000009},null,{"$f":"SUM(J16:J17)","v":754.46591000000012},null,{"$f":"SUM(L16:L17)","v":631.10044505000019},null,{"$f":"SUM(N16:N17)","v":500.94987952775023},null,{"$f":"SUM(P16:P17)","v":363.64103290177638},null,{"$f":"SUM(R16:R17)","v":218.78019971137405}]
[]
{"$rows_left_out":38}
{"sheet":"Target CF","index":4,"n_rows":54,"n_cols":19,"rows_kept":54,"cut":false,"hidden":false,"merged":[[5,5,5,7]]}
[{"$f":"'Target BS'!A1","v":"Target"},null,null,null,null,null,null,null,null,null,null,null,null,null,null,null,null,null,"Statement of Cash Flow"]
["($Millions, except per share data)"]
[]
[]
[]
[null,null,null,null,null,{"$f":"'Target BS'!D6","v":"Actual"},null,null,null,{"$f":"'Target BS'!J6","v":"Projections for the Period Ending December 31,"}]
[null,null,null,null,null,{"$f":"'Target BS'!F7","v":2012},null,{"$f":"'Target BS'!H7","v":2013},null,{"$f":"'Target BS'!J7","v":2014},null,{"$f":"'Target BS'!L7","v":2015},null,{"$f":"'Target BS'!N7","v":2016},null,{"$f":"'Target BS'!P7","v":2017},null,{"$f":"'Target BS'!R7","v":2018}]
[]
[null,"Net Income",null,null,null,{"$f":"'Target IS'!F38","v":-58.999999999999815},null,{"$f":"'Target IS'!H38","v":161.9000000000002},null,{"$f":"'Target IS'!J38","v":177.05525400000022},null,{"$f":"'Target IS'!L38","v":218.71733397000011},null,{"$f":"'Target IS'!N38","v":262.57067057834985},null,{"$f":"'Target IS'!P38","v":308.75157662975926},null,{"$f":"'Target IS'!R38","v":357.40449388077991}]
[]
[null,"Depreciation & Amortization",null,null,null,{"$f":"'Target IS'!F46","v":437.5},null,{"$f":"'Target IS'!H46","v":428.9},null,{"$f":"'Target IS'!J46","v":433.63896},null,{"$f":"'Target IS'!L46","v":440.98910279999996},null,{"$f":"'Target IS'!N46","v":448.74350345400001},null,{"$f":"'Target IS'!P46","v":456.92439614397},null,{"$f":"'Target IS'!R46","v":465.55523793188831}]
[]
[null,"Income from Affiliates, Net of Dividends",null,null,null,{"$f":"'Target IS'!F23-'Target Assumptions'!F42","v":0},null,{"$f":"'Target IS'!H23-'Target Assumptions'!H42","v":0},null,{"$f":"'Target IS'!J23+'Target Assumptions'!J42","v":0},null,{"$f":"'Target IS'!L23+'Target Assumptions'!L42","v":0},null,{"$f":"'Target IS'!N23+'Target Assumptions'!N42","v":0},null,{"$f":"'Target IS'!P23+'Target Assumptions'!P42","v":0},null,{"$f":"'Target IS'!R23+'Target Assumptions'!R42","v":0}]
[]
["Change in"]
[]
[null,"Accounts Receivable",null,null,null,{"$f":"'Target BS'!D10-'Target BS'!F10","v":-49.5},null,{"$f":"'Target BS'!F10-'Target BS'!H10","v":-60.299999999999955},null,{"$f":"'Target BS'!H10-'Target BS'!J10","v":22.24018493150686},null,{"$f":"'Target BS'!J10-'Target BS'!L10","v":-37.128289828767151},null,{"$f":"'Target BS'!L10-'Target BS'!N10","v":-39.170345769349183},null,{"$f":"'Target BS'!N10-'Target BS'!P10","v":-41.324714786663662},null,{"$f":"'Target BS'!P10-'Target BS'!R10","v":-43.597574099929943}]
[null,"Inventory",null,null,null,{"$f":"'Target BS'!D11-'Target BS'!F11","v":-54.799999999999955},null,{"$f":"'Target BS'!F11-'Target BS'!H11","v":-25.600000000000023},null,{"$f":"'Target BS'!H11-'Target BS'!J11","v":-9.7739071232876427},null,{"$f":"'Target BS'!J11-'Target BS'!L11","v":-22.730064891780785},null,{"$f":"'Target BS'!L11-'Target BS'!N11","v":-23.980218460828837},null,{"$f":"'Target BS'!N11-'Target BS'!P11","v":-25.299130476174298},null,{"$f":"'Target BS'!P11-'Target BS'!R11","v":-26.690582652363901}]
[null,"Other Current Assets",null,null,null,{"$f":"'Target BS'!D12-'Target BS'!F12","v":84.4},null,{"$f":"'Target BS'!F12-'Target BS'!H12","v":-51.5},null,{"$f":"'Target BS'!H12-'Target BS'!J12","v":18.408037500000006},null,{"$f":"'Target BS'!J12-'Target BS'!L12","v":-12.633057937500013},null,{"$f":"'Target BS'!L12-'Target BS'!N12","v":-13.32787612406247},null,{"$f":"'Target BS'!N12-'Target BS'!P12","v":-14.060909310885933},null,{"$f":"'Target BS'!P12-'Target BS'!R12","v":-14.834259322984622}]
[null,"Accounts Payable",null,null,null,{"$f":"'Target BS'!F29-'Target BS'!D29","v":4},null,{"$f":"'Target BS'!H29-'Target BS'!F29","v":8.1999999999999886},null,{"$f":"'Target BS'!J29-'Target BS'!H29","v":10.197098630136963},null,{"$f":"'Target BS'!L29-'Target BS'!J29","v":10.823840424657533},null,{"$f":"'Target BS'!N29-'Target BS'!L29","v":11.419151648013724},null,{"$f":"'Target BS'!P29-'Target BS'!N29","v":12.047204988654414},null,{"$f":"'Target BS'!R29-'Target BS'!P29","v":12.709801263030471}]
{"$rows_left_out":35}
{"sheet":"Valuation","index":5,"n_rows":35,"n_cols":12,"rows_kept":35,"cut":false,"hidden":false,"merged":[[32,1,32,2],[33,1,33,2],[22,9,22,15],[21,9,21,15],[17,9,17,15],[19,1,19,2],[24,1,24,2],[25,1,25,2],[29,1,29,2],[7,1,7,2],[11,9,11,15],[15,9,15,15],[16,9,16,15],[4,9,4,15],[6,1,6,2],[8,1,8,2],[10,9,10,15],[8,9,8,15],[9,9,9,15]]}
[null,"Valuation"]
[]
[null,"Target",null,2014,2015,2016,2017,2018]
[null,"Free Cash Flow",null,null,null,null,null,null,null,"Definitions"]
[null,"EBIT",null,{"$f":"'Target IS'!J20","v":390.6370900000004},{"$f":"'Target IS'!L20","v":445.07388995000019},{"$f":"'Target IS'!N20","v":503.1627842972498},{"$f":"'Target IS'!P20","v":565.13096104959868},{"$f":"'Target IS'!R20","v":631.21915646796651},null,"WACC = (D/(D+E))*[(1-T)*[Cost of Debt]]+(E/(D+E))*ke"]
[null,"Less: Taxes",null,{"$f":"D5*'Target Assumptions'!J47","v":156.25483600000018},{"$f":"E5*'Target Assumptions'!L47","v":178.02955598000008},{"$f":"F5*'Target Assumptions'!N47","v":201.26511371889993},{"$f":"G5*'Target Assumptions'!P47","v":226.05238441983948},{"$f":"H5*'Target Assumptions'!R47","v":252.48766258718661},null,"D = Debt"]
[null,"Plus: Deprec. & Amort..",null,{"$f":"'Target IS'!J17+'Target IS'!J18","v":433.63896},{"$f":"'Target IS'!L17+'Target IS'!L18","v":440.98910279999996},{"$f":"'Target IS'!N17+'Target IS'!N18","v":448.74350345400001},{"$f":"'Target IS'!P17+'Target IS'!P18","v":456.92439614397},{"$f":"'Target IS'!R17+'Target IS'!R18","v":465.55523793188831},null,"E = Equity"]
[null,"Less: Gross Capex",null,{"$f":"-'Target CF'!J29","v":16.70487},{"$f":"-'Target CF'!L29","v":17.623637849999998},{"$f":"-'Target CF'!N29","v":18.592937931750001},{"$f":"-'Target CF'!P29","v":19.61554951799625},{"$f":"-'Target CF'!R29","v":20.694404741486039},null,"T = Corporate marginal tax rate",null," (i.e., 40%)"]
[null,"Less: ∆ NWC",null,{"$f":"'Target CF'!J17+'Target CF'!J18+'Target CF'!J20+'Target CF'!J23+'Target CF'!J25","v":22.663376438356181},{"$f":"'Target CF'!L17+'Target CF'!L18+'Target CF'!L20+'Target CF'!L23+'Target CF'!L25","v":-49.034514295890403},{"$f":"'Target CF'!N17+'Target CF'!N18+'Target CF'!N20+'Target CF'!N23+'Target CF'!N25","v":-51.731412582164296},{"$f":"'Target CF'!P17+'Target CF'!P18+'Target CF'!P20+'Target CF'!P23+'Target CF'!P25","v":-54.576640274183546},{"$f":"'Target CF'!R17+'Target CF'!R18+'Target CF'!R20+'Target CF'!R23+'Target CF'!R25","v":-57.578355489263373},null,"ke = Cost of Equity (Estimated using the Capital Asset Pricing Model)"]
[null,"Equals: Free Cash Flow",null,{"$f":"SUM(D5:D9)","v":1019.8991324383568},{"$f":"SUM(E5:E9)","v":1032.6816722841097},1120.0329268197354,1213.1466508572207,1312.3781062392641,null,"NWC = Net working capital excluding cash & marketable securities"]
[null,"Period",null,1,1,1,1,1,null,"Discount factor uses mid-year convention in which cash flows occur evenly"]
[null,"Mid-Year Convention",null,{"$f":"D11/2","v":0.5},{"$f":"D11+E11/2","v":1.5},{"$f":"F11/2+SUM(D11:E11)","v":2.5},{"$f":"G11/2+SUM(D11:F11)","v":3.5},{"$f":"H11/2+SUM(D11:G11)","v":4.5},null,"     throughout the year."]
[null,"Discount Factor",null,{"$f":"1/(1+D24)^D12","v":0.95429712996487337},{"$f":"1/(1+D24)^E12","v":0.86906218490671472},{"$f":"1/(1+D24)^F12","v":0.79144016839140385},{"$f":"1/(1+D24)^G12","v":0.72075111657360769},{"$f":"1/(1+D24)^H12","v":0.65637579793043077},null,"Rf = Risk free rate approximated by the 10-year U.S. treasury bond rate."]
[null,"PV FCFF",null,{"$f":"D10*D13","v":973.28681493958811},{"$f":"E10*E13","v":897.46459042834829},886.43904820612829,874.37680317287447,861.41322666922463,null,"Rm = Return on a broad based stock index"]
[null,null,null,null,null,null,null,null,null,"Rf - Rm = Average historical equity risk premium since 1963"]
[null,"PV (Years 1- 5)",null,{"$f":"SUM(D14:H14)","v":4492.9804834161641},null,null,null,null,null,"Period reflects months of actual data available for first forecast year, i.e., "]
[null,"PV (Terminal Value)",null,{"$f":"+IF(ISERROR(D33*(1+D34)/(D35-D34)*H13),0,D33*(1+D34)/(D35-D34)*H13)","v":13863.369116707832},null,null,null,null,null,"     if have 9 months actual data, period 1 equals .25, if have one half"]
[null,"   Enterprise Value",null,{"$f":"SUM(D16:D17)","v":18356.349600123998},null,null,null,null,null,"     year of data, period 1 is .5; if 3 months available, period 1 equals.75"]
[null,"Plus Cash",null,{"$f":"'Target BS'!H9","v":276.3},null,null,null,null,null,"FCF2020 is recalculated to reflect the maximum marginal tax rate rather than the "]
[null,"Less Debt & Min. Int.",null,{"$f":"'Target BS'!H38+'Target BS'!H50","v":2061.7000000000003},null,null,null,null,null,"     effective tax rate."]
{"$rows_left_out":15}