{"text_format":"1","workbook":"xlsx","n_sheets":17,"sheets":["Model Instructions","Summary","Target Assumptions","Target IS","Target BS","Target CF","Acquirer Assumptions","Acquirer IS","Acquirer BS","Acquirer CF","Newco Assumptions","Newco IS","Newco BS","Newco CF","Debt Repayment","Options-Convertibles","Valuation"],"not_rendered":{"charts":0,"images":0,"macros":1,"external_links":0,"defined_names":191,"comments":2,"pivot_tables":0},"unopened":[],"bounds":{"document_bytes":16777216,"sheet_cells":100000,"rows_first":2000,"rows_last":500,"rows_between":2000,"halvings":0,"cell_chars":16384,"cell_head_chars":4096},"cells_cut":0,"cells_raw":0,"read":"whole","date_system":"1900"}

{"sheet":"Model Instructions","index":0,"n_rows":1,"n_cols":1,"rows_kept":1,"cut":false,"hidden":false,"merged":[]}
["Model Instructions"]

{"sheet":"Summary","index":1,"n_rows":63,"n_cols":18,"rows_kept":63,"cut":false,"hidden":false,"merged":[[55,8,55,9],[55,14,55,15],[0,0,0,19],[1,0,1,3],[54,8,54,11],[20,14,20,17],[4,2,4,5],[54,14,54,17]]}
["Thermo Fisher Transaction Summary"]
["($Millions, except per share data)"]
[]
[]
[null,null,"Transaction Value",null,null,null,null,null,"Form of Payment",null,null,null,null,null,"Sources & Uses"]
[]
[null,null,"Price Per Share",null,null,76,null,null,"% Stock",null,null,0,null,null,"Excess Cash",null,null,1000]
[null,null,"Target Shares Outstanding",null,null,{"$f":"'Target Assumptions'!H54","v":174.5},null,null,"% Cash",null,null,{"$f":"1-L7","v":1},null,null,"Common Shares Issued to Target Shareholders",null,null,{"$f":"F10*L7","v":0}]
[null,null,"Dilutive Effect: Stock Options/Security Conv",null,null,{"$f":"'Options-Convertibles'!G17+'Options-Convertibles'!G27+'Options-Convertibles'!N12","v":4.5867671052631573},null,null,null,null,null,null,null,null,"New Common Shares Issued",null,null,2200]
[null,null,"   Equity Consideration",null,null,{"$f":"F7*(F8+F9)","v":13610.594300000001},null,null,"Target Preannouncement Share Price",null,null,60.75,null,null,"Convertible Preferred Equity",0,null,1050]
{"$rows_left_out":54}
{"sheet":"Target Assumptions","index":2,"n_rows":59,"n_cols":18,"rows_kept":59,"cut":false,"hidden":false,"merged":[]}
["Life Technologies (Target)",null,null,null,null,null,null,null,null,null,null,null,null,null,null,"          Assumptions"]
["($Millions, except per share data)"]
[]
[]
[]
[null,null,null,"Actual",null,null,null,null,null,"Projections for the Period Ending December 31,"]
[null,null,null,2011,null,{"$f":"D7+1","v":2012},null,{"$f":"F7+1","v":2013},null,{"$f":"H7+1","v":2014},null,{"$f":"J7+1","v":2015},null,{"$f":"L7+1","v":2016},null,{"$f":"N7+1","v":2017},null,{"$f":"P7+1","v":2018}]
[]
[null,"Income Statement"]
[]
{"$rows_left_out":50}
{"sheet":"Target IS","index":3,"n_rows":57,"n_cols":22,"rows_kept":57,"cut":false,"hidden":false,"merged":[]}
[{"$f":"'Target Assumptions'!A1","v":"Life Technologies (Target)"},null,null,null,null,null,null,null,null,null,null,null,null,null,null,null,null,null,"Income Statement"]
["($Millions, except per share data)"]
[]
[]
[]
[null,null,null,{"$f":"'Target Assumptions'!D6","v":"Actual"},null,null,null,null,null,{"$f":"'Target Assumptions'!J6","v":"Projections for the Period Ending December 31,"},null,null,null,null,null,null,null,null,null,null,1," 0 = circ off"]
[null,null,null,{"$f":"'Target Assumptions'!D7","v":2011},null,{"$f":"'Target Assumptions'!F7","v":2012},null,{"$f":"'Target Assumptions'!H7","v":2013},null,{"$f":"'Target Assumptions'!J7","v":2014},null,{"$f":"'Target Assumptions'!L7","v":2015},null,{"$f":"'Target Assumptions'!N7","v":2016},null,{"$f":"'Target Assumptions'!P7","v":2017},null,{"$f":"'Target Assumptions'!R7","v":2018},null,null,null," 1 = circ on"]
[]
[null,"Sales",null,3588.1,null,3775.7,null,3798.5,null,{"$f":"H9*(1+'Target Assumptions'!J11)","v":4064.3950000000004},null,{"$f":"J9*(1+'Target Assumptions'!L11)","v":4348.9026500000009},null,{"$f":"L9*(1+'Target Assumptions'!N11)","v":4653.3258355000016},null,{"$f":"N9*(1+'Target Assumptions'!P11)","v":4979.0586439850022},null,{"$f":"P9*(1+'Target Assumptions'!R11)","v":5327.5927490639524}]
[]
{"$rows_left_out":48}
{"sheet":"Target BS","index":4,"n_rows":57,"n_cols":19,"rows_kept":57,"cut":false,"hidden":false,"merged":[]}
[{"$f":"'Target IS'!A1","v":"Life Technologies (Target)"},null,null,null,null,null,null,null,null,null,null,null,null,null,null,null,null,null,"Balance Sheet"]
["($Millions, except per share data)"]
[]
[]
[]
[null,null,null,{"$f":"'Target IS'!D6","v":"Actual"},null,null,null,null,null,{"$f":"'Target IS'!J6","v":"Projections for the Period Ending December 31,"}]
[null,null,null,{"$f":"'Target IS'!D7","v":2011},null,{"$f":"'Target IS'!F7","v":2012},null,{"$f":"'Target IS'!H7","v":2013},null,{"$f":"'Target IS'!J7","v":2014},null,{"$f":"'Target IS'!L7","v":2015},null,{"$f":"'Target IS'!N7","v":2016},null,{"$f":"'Target IS'!P7","v":2017},null,{"$f":"'Target IS'!R7","v":2018}]
[]
[null,"Cash",null,{"$f":"813.6+23.1+18.2","v":854.90000000000009},187.3,{"$f":"838.8+26.6+16.7","v":882.1},null,{"$f":"255.5+5.7+15.1","v":276.3},null,{"$f":"'Target CF'!J52","v":818.42104427123331},null,{"$f":"'Target CF'!L52","v":1174.7682088102199},null,{"$f":"'Target CF'!N52","v":1610.7705805603757},null,{"$f":"'Target CF'!P52","v":2132.1360324345119},null,{"$f":"'Target CF'!R52","v":2744.9918006679454}]
[null,"Accounts Receivable",null,587.5,null,637,null,697.3,null,{"$f":"('Target Assumptions'!J22*'Target IS'!J9)/365","v":656.98439726027402},null,{"$f":"('Target Assumptions'!L22*'Target IS'!L9)/365","v":702.97330506849323},null,{"$f":"('Target Assumptions'!N22*'Target IS'!N9)/365","v":752.18143642328789},null,{"$f":"('Target Assumptions'!P22*'Target IS'!P9)/365","v":804.83413697291815},null,{"$f":"('Target Assumptions'!R22*'Target IS'!R9)/365","v":861.17252656102244}]
{"$rows_left_out":48}
{"sheet":"Target CF","index":5,"n_rows":54,"n_cols":19,"rows_kept":54,"cut":false,"hidden":false,"merged":[[5,5,5,7]]}
[{"$f":"'Target BS'!A1","v":"Life Technologies (Target)"},null,null,null,null,null,null,null,null,null,null,null,null,null,null,null,null,null,"Statement of Cash Flow"]
["($Millions, except per share data)"]
[]
[]
[]
[null,null,null,null,null,{"$f":"'Target BS'!D6","v":"Actual"},null,null,null,{"$f":"'Target BS'!J6","v":"Projections for the Period Ending December 31,"}]
[null,null,null,null,null,{"$f":"'Target BS'!F7","v":2012},null,{"$f":"'Target BS'!H7","v":2013},null,{"$f":"'Target BS'!J7","v":2014},null,{"$f":"'Target BS'!L7","v":2015},null,{"$f":"'Target BS'!N7","v":2016},null,{"$f":"'Target BS'!P7","v":2017},null,{"$f":"'Target BS'!R7","v":2018}]
[]
[null,"Net Income",null,null,null,{"$f":"'Target IS'!F38","v":-58.999999999999815},null,{"$f":"'Target IS'!H38","v":1.9000000000001704},null,{"$f":"'Target IS'!J38","v":160.95242400000032},null,{"$f":"'Target IS'!L38","v":226.81730112000017},null,{"$f":"'Target IS'!N38","v":297.40541789184044},null,{"$f":"'Target IS'!P38","v":373.06671124573882},null,{"$f":"'Target IS'!R38","v":454.17611576104815}]
[]
{"$rows_left_out":45}
{"sheet":"Acquirer Assumptions","index":6,"n_rows":59,"n_cols":19,"rows_kept":59,"cut":false,"hidden":false,"merged":[]}
["Thermo (Acquirer)",null,null,null,null,null,null,null,null,null,null,null,null,null,null,null,null,null,"Assumptions"]
[null,"($Millions, except per share data)"]
[]
[]
[]
[null,null,null,"Actual",null,null,null,null,null,"Projections for the Period Ending December 31,"]
[null,null,null,2011,null,{"$f":"D7+1","v":2012},null,{"$f":"F7+1","v":2013},null,{"$f":"H7+1","v":2014},null,{"$f":"J7+1","v":2015},null,{"$f":"L7+1","v":2016},null,{"$f":"N7+1","v":2017},null,{"$f":"P7+1","v":2018}]
[]
[null,"Income Statement"]
[]
{"$rows_left_out":50}
{"sheet":"Acquirer IS","index":7,"n_rows":57,"n_cols":22,"rows_kept":57,"cut":false,"hidden":false,"merged":[]}
[{"$f":"'Acquirer Assumptions'!A1","v":"Thermo (Acquirer)"},null,null,null,null,null,null,null,null,null,null,null,null,null,null,null,null,null,"Income Statement"]
["($Millions except per share data)"]
[]
[]
[]
[null,null,null,{"$f":"'Acquirer Assumptions'!D6","v":"Actual"},null,null,null,null,null,{"$f":"'Acquirer Assumptions'!J6","v":"Projections for the Period Ending December 31,"},null,null,null,null,null,null,null,null,null,null,1," 0 = circ off"]
[null,null,null,{"$f":"'Acquirer Assumptions'!D7","v":2011},null,{"$f":"'Acquirer Assumptions'!F7","v":2012},null,{"$f":"'Acquirer Assumptions'!H7","v":2013},null,{"$f":"'Acquirer Assumptions'!J7","v":2014},null,{"$f":"'Acquirer Assumptions'!L7","v":2015},null,{"$f":"'Acquirer Assumptions'!N7","v":2016},null,{"$f":"'Acquirer Assumptions'!P7","v":2017},null,{"$f":"'Acquirer Assumptions'!R7","v":2018},null,null,null," 1 = circ on"]
[]
[null,"Sales",null,10393.1,null,11558.8,null,12509.9,null,{"$f":"H9*(1+'Acquirer Assumptions'!J11)","v":13510.692000000001},null,{"$f":"J9*(1+'Acquirer Assumptions'!L11)","v":14591.547360000002},null,{"$f":"L9*(1+'Acquirer Assumptions'!N11)","v":15758.871148800003},null,{"$f":"N9*(1+'Acquirer Assumptions'!P11)","v":17019.580840704002},null,{"$f":"P9*(1+'Acquirer Assumptions'!R11)","v":18381.147307960324}]
[]
{"$rows_left_out":48}
{"sheet":"Acquirer BS","index":8,"n_rows":57,"n_cols":19,"rows_kept":57,"cut":false,"hidden":false,"merged":[]}
[{"$f":"'Acquirer Assumptions'!A1","v":"Thermo (Acquirer)"},null,null,null,null,null,null,null,null,null,null,null,null,null,null,null,null,null,"Balance Sheet"]
["($Millions, except per share data)"]
[]
[]
[]
[null,null,null,{"$f":"'Acquirer IS'!D6","v":"Actual"},null,null,null,null,null,{"$f":"'Acquirer IS'!J6","v":"Projections for the Period Ending December 31,"}]
[null,null,null,{"$f":"'Acquirer IS'!D7","v":2011},null,{"$f":"'Acquirer IS'!F7","v":2012},null,{"$f":"'Acquirer IS'!H7","v":2013},null,{"$f":"'Acquirer IS'!J7","v":2014},null,{"$f":"'Acquirer IS'!L7","v":2015},null,{"$f":"'Acquirer IS'!N7","v":2016},null,{"$f":"'Acquirer IS'!P7","v":2017},null,{"$f":"'Acquirer IS'!R7","v":2018}]
[]
[null,"Cash and ST Investments",null,{"$f":"917.8+8.7","v":926.5},null,{"$f":"1016.3+4.3","v":1020.5999999999999},null,{"$f":"851+4.3","v":855.3},null,{"$f":"'Acquirer CF'!J52","v":1209.7137338147932},null,{"$f":"'Acquirer CF'!L52","v":1432.8827932799759},null,{"$f":"'Acquirer CF'!N52","v":1762.5973145763737},null,{"$f":"'Acquirer CF'!P52","v":2207.8905856056617},null,{"$f":"'Acquirer CF'!R52","v":2778.6578328685173}]
[null,"Accounts Receivable",null,1473.9,null,1763.7,null,1804.9,null,{"$f":"('Acquirer Assumptions'!J22*'Acquirer IS'!J9)/365","v":1887.7953205479453},null,{"$f":"('Acquirer Assumptions'!L22*'Acquirer IS'!L9)/365","v":2038.8189461917812},null,{"$f":"('Acquirer Assumptions'!N22*'Acquirer IS'!N9)/365","v":2201.9244618871235},null,{"$f":"('Acquirer Assumptions'!P22*'Acquirer IS'!P9)/365","v":2378.0784188380935},null,{"$f":"('Acquirer Assumptions'!R22*'Acquirer IS'!R9)/365","v":2568.3246923451411}]
{"$rows_left_out":48}
{"sheet":"Acquirer CF","index":9,"n_rows":54,"n_cols":19,"rows_kept":54,"cut":false,"hidden":false,"merged":[]}
[{"$f":"'Acquirer Assumptions'!A1","v":"Thermo (Acquirer)"},null,null,null,null,null,null,null,null,null,null,null,null,null,null,null,null,null,"Statement of Cash Flow"]
["($Millions, except per share data)"]
[]
[]
[]
[null,null,null,null,null,{"$f":"'Acquirer BS'!D6","v":"Actual"},null,null,null,{"$f":"'Acquirer BS'!J6","v":"Projections for the Period Ending December 31,"}]
[null,null,null,null,null,{"$f":"'Acquirer BS'!F7","v":2012},null,{"$f":"'Acquirer BS'!H7","v":2013},null,{"$f":"'Acquirer BS'!J7","v":2014},null,{"$f":"'Acquirer BS'!L7","v":2015},null,{"$f":"'Acquirer BS'!N7","v":2016},null,{"$f":"'Acquirer BS'!P7","v":2017},null,{"$f":"'Acquirer BS'!R7","v":2018}]
[]
[null,"Net Income",null,null,null,{"$f":"'Acquirer IS'!F38","v":434.29999999999984},null,{"$f":"'Acquirer IS'!H38","v":194.19999999999965},null,{"$f":"'Acquirer IS'!J38","v":411.99259055999903},null,{"$f":"'Acquirer IS'!L38","v":510.0884480047992},null,{"$f":"'Acquirer IS'!N38","v":616.41146091918313},null,{"$f":"'Acquirer IS'!P38","v":731.74996582189692},null,{"$f":"'Acquirer IS'!R38","v":856.96447763887249}]
[]
{"$rows_left_out":45}
{"sheet":"Newco Assumptions","index":10,"n_rows":59,"n_cols":19,"rows_kept":59,"cut":false,"hidden":false,"merged":[]}
["Newco",null,null,null,null,null,null,null,null,null,null,null,null,null,null,null,null,null,"Assumptions"]
["($Millions except per share data)"]
[]
[]
[]
[null,null,null,"Actual",null,null,null,null,null,"Projections"]
[null,null,null,2011,null,{"$f":"D7+1","v":2012},null,{"$f":"F7+1","v":2013},null,{"$f":"H7+1","v":2014},null,{"$f":"J7+1","v":2015},null,{"$f":"L7+1","v":2016},null,{"$f":"N7+1","v":2017},null,{"$f":"P7+1","v":2018}]
[]
[null,"Income Statement"]
[]
{"$rows_left_out":50}
{"sheet":"Newco IS","index":11,"n_rows":58,"n_cols":26,"rows_kept":58,"cut":false,"hidden":false,"merged":[]}
[{"$f":"'Newco Assumptions'!A1","v":"Newco"},null,null,null,null,null,null,null,null,null,null,null,null,null,null,null,null,null,null,null,null,null,"Pro Forma Income Statement"]
["($Millions, except per share data)"]
[]
[]
[]
[null,null,null,"Actual",null,null,{"$f":"\"Projected \"&('Newco Assumptions'!J7)&\"\"","v":"Projected 2014"},null,null,null,"Trans",null,"Pro Forma",null,null,{"$f":"'Newco Assumptions'!J6","v":"Projections"},null,null,null,null,null,null,null,null,1," 0 = circ off"]
[null,null,null,{"$f":"'Acquirer Assumptions'!H7","v":2013},null,null,{"$f":"'Acquirer Assumptions'!A1","v":"Thermo (Acquirer)"},null,"Target",null,"Adj",null,{"$f":"'Newco Assumptions'!J7","v":2014},null,null,{"$f":"'Acquirer Assumptions'!L7","v":2015},null,{"$f":"'Acquirer Assumptions'!N7","v":2016},null,{"$f":"'Acquirer Assumptions'!P7","v":2017},null,{"$f":"'Acquirer Assumptions'!R7","v":2018},null,null,null," 1 = circ on"]
[]
[null,"Sales",null,{"$f":"'Acquirer IS'!H9","v":12509.9},null,null,{"$f":"'Acquirer IS'!J9","v":13510.692000000001},null,{"$f":"'Target IS'!J9","v":4064.3950000000004},null,{"$f":"Summary!R39","v":5},null,{"$f":"G9+I9+K9","v":17580.087},null,null,{"$f":"'Target IS'!L9+'Acquirer IS'!L9+Summary!R40","v":18960.450010000004},null,{"$f":"'Target IS'!N9+'Acquirer IS'!N9+Summary!R41","v":20437.196984300004},null,{"$f":"'Target IS'!P9+'Acquirer IS'!P9+Summary!R42","v":22023.639484689003},null,{"$f":"'Target IS'!R9+'Acquirer IS'!R9+Summary!R43","v":23733.740057024275}]
[]
{"$rows_left_out":49}
{"sheet":"Newco BS","index":12,"n_rows":59,"n_cols":25,"rows_kept":59,"cut":false,"hidden":false,"merged":[]}
[{"$f":"'Newco IS'!A1","v":"Newco"},null,null,null,null,null,null,null,null,null,null,null,null,null,null,null,null,null,null,null,null,null,null,null,"Pro Forma Balance Sheet"]
["($Millions, except per share data)"]
[]
[]
[]
[null,null,null,null,{"$f":"\"Actual \"&('Newco Assumptions'!H7)&\"\"","v":"Actual 2013"},null,null,null,"Pre-Trans",null,"Trans",null,"Pro Forma",null,null,{"$f":"'Newco IS'!P6","v":"Projections"}]
[null,null,null,null,{"$f":"'Acquirer IS'!A1","v":"Thermo (Acquirer)"},null,"Target",null,"Adj",null,"Adj",null,{"$f":"'Newco Assumptions'!H7","v":2013},null,null,{"$f":"'Acquirer IS'!J7","v":2014},null,{"$f":"'Acquirer IS'!L7","v":2015},null,{"$f":"'Acquirer IS'!N7","v":2016},null,{"$f":"'Acquirer IS'!P7","v":2017},null,{"$f":"'Acquirer IS'!R7","v":2018}]
[]
[null,"Cash",null,null,{"$f":"'Acquirer BS'!H9","v":855.3},null,{"$f":"'Target BS'!H9","v":276.3},null,null,null,{"$f":"-Summary!R7","v":-1000},null,{"$f":"E9+G9+I9+K9","v":131.59999999999991},null,null,{"$f":"+IF(ISERROR('Newco CF'!J52),0,'Newco CF'!J52)","v":1307.9255712357813},null,{"$f":"'Newco CF'!L52","v":1016.7384334941653},null,{"$f":"'Newco CF'!N52","v":1082.8134390325415},null,{"$f":"'Newco CF'!P52","v":1434.6335343512033},null,{"$f":"'Newco CF'!R52","v":2061.9254045058497}]
[null,"Accounts Receivable",null,null,{"$f":"'Acquirer BS'!H10","v":1804.9},null,{"$f":"'Target BS'!H10","v":697.3},null,null,null,null,null,{"$f":"E10+G10+I10+K10","v":2502.1999999999998},null,null,{"$f":"('Newco Assumptions'!J23*'Newco IS'!M9)/365","v":2545.5036913845115},null,{"$f":"('Newco Assumptions'!L23*'Newco IS'!P9)/365","v":2744.6874224413314},null,{"$f":"('Newco Assumptions'!N23*'Newco IS'!R9)/365","v":2957.7239629173014},null,{"$f":"('Newco Assumptions'!P23*'Newco IS'!T9)/365","v":3186.5297255887444},null,{"$f":"('Newco Assumptions'!R23*'Newco IS'!V9)/365","v":3433.1134983991456}]
{"$rows_left_out":50}
{"sheet":"Newco CF","index":13,"n_rows":54,"n_cols":19,"rows_kept":54,"cut":false,"hidden":false,"merged":[]}
[{"$f":"'Newco IS'!A1","v":"Newco"},null,null,null,null,null,null,null,null,null,null,null,null,null,null,null,null,null,"Pro Forma Statement of Cash Flow"]
["($Millions, except per share data)"]
[]
[]
[]
[null,null,null,null,null,{"$f":"'Newco Assumptions'!D6","v":"Actual"},null,null,null,{"$f":"'Newco BS'!P6","v":"Projections"}]
[null,null,null,null,null,{"$f":"'Acquirer BS'!F7","v":2012},null,{"$f":"'Acquirer BS'!H7","v":2013},null,{"$f":"'Acquirer BS'!J7","v":2014},null,{"$f":"'Acquirer BS'!L7","v":2015},null,{"$f":"'Acquirer BS'!N7","v":2016},null,{"$f":"'Acquirer BS'!P7","v":2017},null,{"$f":"'Acquirer BS'!R7","v":2018}]
[]
[null,"Net Income",null,null,null,{"$f":"'Acquirer CF'!F9","v":434.29999999999984},null,{"$f":"'Acquirer CF'!H9","v":194.19999999999965},null,{"$f":"'Newco IS'!M39","v":-64.029561331084722},null,{"$f":"'Newco IS'!P39","v":589.75093300894264},null,{"$f":"'Newco IS'!R39","v":908.12541465966819},null,{"$f":"'Newco IS'!T39","v":1144.1075616869186},null,{"$f":"'Newco IS'!V39","v":1396.6861296190032}]
[]
{"$rows_left_out":45}
{"sheet":"Debt Repayment","index":14,"n_rows":52,"n_cols":20,"rows_kept":52,"cut":false,"hidden":false,"merged":[]}
[{"$f":"'Newco Assumptions'!A1","v":"Newco"},null,null,null,null,null,null,null,null,null,null,null,null,null,null,null,"Debt Repayment Schedule"]
["($ in millions except per share figures)"]
[]
[null,null,null,null,null,"Actual",null,{"$f":"'Newco BS'!P6","v":"Projections"}]
[null,"Principal Payments",null,null,null,{"$f":"'Newco BS'!M7","v":2013},null,{"$f":"F5+1","v":2014},null,{"$f":"H5+1","v":2015},null,{"$f":"J5+1","v":2016},null,{"$f":"L5+1","v":2017},null,{"$f":"N5+1","v":2018}]
[]
[null,{"$f":"'Acquirer Assumptions'!A1","v":"Thermo (Acquirer)"}]
[]
[null,"Revolving Credit Facility",null,null,null,0,null,0,null,0,null,0,null,0,null,0]
[null,"Senior Debt",null,null,null,{"$f":"'Acquirer Assumptions'!H39","v":354.5},null,{"$f":"'Acquirer Assumptions'!J39","v":500},null,{"$f":"'Acquirer Assumptions'!L39","v":500},null,{"$f":"'Acquirer Assumptions'!N39","v":500},null,{"$f":"'Acquirer Assumptions'!P39","v":500},null,{"$f":"'Acquirer Assumptions'!R39","v":500}]
{"$rows_left_out":43}
{"sheet":"Options-Convertibles","index":15,"n_rows":27,"n_cols":14,"rows_kept":27,"cut":false,"hidden":false,"merged":[[3,1,3,6],[3,8,3,13],[18,1,18,6],[4,1,4,2],[13,2,13,4],[15,2,15,5],[16,2,16,4]]}
[null,"Target","Options-Convertible Securities Analysis"]
[]
[]
[null,"Target Options Schedule",null,null,null,null,null,null,"Target Convertible Preferred Schedule"]
[null,"     Potential Options:",null,"Strike","In the $?","Include?","Proceeds",null,"Balance","Par Value","CV Ratio","CV Price","Converted?","Shares"]
[null,null,9.0449999999999999,37.46,{"$f":"IF(D6<Summary!$F$7,\"Yes\",\"No\")","v":"Yes"},{"$f":"IF(E6=\"Yes\",C6,\"No\")","v":9.0449999999999999},{"$f":"+IF(ISERROR(D6*F6),0,D6*F6)","v":338.82569999999998},null,0,0,0,{"$f":"+IF(ISERROR(J6/K6),0,J6/K6)","v":0},{"$f":"IF(L6<Summary!$F$7,\"Yes\",\"No\")","v":"Yes"},{"$f":"+IF(ISERROR(I6/J6*K6),0,I6/J6*K6)","v":0}]
[null,null,0,0,{"$f":"IF(D7<Summary!$F$7,\"Yes\",\"No\")","v":"Yes"},{"$f":"IF(E7=\"Yes\",C7,\"No\")","v":0},{"$f":"+IF(ISERROR(D7*F7),0,D7*F7)","v":0},null,0,0,0,{"$f":"+IF(ISERROR(J7/K7),0,J7/K7)","v":0},{"$f":"IF(L7<Summary!$F$7,\"Yes\",\"No\")","v":"Yes"},{"$f":"+IF(ISERROR(I7/J7*K7),0,I7/J7*K7)","v":0}]
[null,null,0,0,{"$f":"IF(D8<Summary!$F$7,\"Yes\",\"No\")","v":"Yes"},0,0,null,0,0,0,0,{"$f":"IF(L8<Summary!$F$7,\"Yes\",\"No\")","v":"Yes"},0]
[null,null,0,0,{"$f":"IF(D9<Summary!$F$7,\"Yes\",\"No\")","v":"Yes"},0,0,null,0,0,0,0,{"$f":"IF(L9<Summary!$F$7,\"Yes\",\"No\")","v":"Yes"},0]
[null,null,0,0,{"$f":"IF(D10<Summary!$F$7,\"Yes\",\"No\")","v":"Yes"},0,0,null,0,0,0,0,{"$f":"IF(L10<Summary!$F$7,\"Yes\",\"No\")","v":"Yes"},0]
{"$rows_left_out":18}
{"sheet":"Valuation","index":16,"n_rows":79,"n_cols":16,"rows_kept":79,"cut":false,"hidden":false,"merged":[[25,9,25,10],[57,1,57,2],[29,1,29,2],[6,9,6,10],[24,9,24,10],[43,9,43,15],[41,9,41,15],[42,9,42,15],[7,1,7,2],[6,1,6,2],[8,1,8,2],[19,1,19,2],[7,9,7,10],[8,9,8,10],[19,9,19,10],[24,1,24,2],[25,1,25,2],[69,1,69,5],[32,1,32,2],[33,1,33,2],[58,1,58,2],[40,1,40,2],[41,1,41,2],[42,1,42,2],[55,9,55,15],[54,9,54,15],[32,9,32,10],[33,9,33,10],[50,9,50,15],[44,9,44,15],[48,9,48,15],[49,9,49,15],[37,9,37,15]]}
[null,"Valuation"]
[]
[null,"Target: Life Technologies",null,2014,{"$f":"D3+1","v":2015},{"$f":"E3+1","v":2016},2017,2018,null,"Acquirer: Thermo Fisher",null,2014,{"$f":"L3+1","v":2015},{"$f":"M3+1","v":2016},2017,2018]
[null,"Free Cash Flow",null,null,null,null,null,null,null,"Free Cash Flow"]
[null,"EBIT",null,{"$f":"'Target IS'!J20","v":373.79904000000056},{"$f":"'Target IS'!L20","v":468.5738352000003},{"$f":"'Target IS'!N20","v":571.22069648640081},{"$f":"'Target IS'!P20","v":682.32285207623136},{"$f":"'Target IS'!R20","v":802.50519293508023},null,"EBIT",null,{"$f":"'Acquirer IS'!J20","v":895.80674399999862},{"$f":"'Acquirer IS'!L20","v":1003.3687135199989},{"$f":"'Acquirer IS'!N20","v":1122.0484607015987},{"$f":"'Acquirer IS'!P20","v":1252.9113051647255},{"$f":"'Acquirer IS'!R20","v":1397.1201049173951}]
[null,"Less: Taxes",null,{"$f":"-'Target IS'!J31","v":-107.30161600000022},{"$f":"-'Target IS'!L31","v":-151.21153408000012},{"$f":"-'Target IS'!N31","v":-198.27027859456032},{"$f":"-'Target IS'!P31","v":-248.71114083049258},{"$f":"-'Target IS'!R31","v":-302.78407717403212},null,"Less: Taxes",null,{"$f":"-'Acquirer IS'!J31","v":-144.75415343999967},{"$f":"-'Acquirer IS'!L31","v":-179.22026551519974},{"$f":"-'Acquirer IS'!N31","v":-216.5769997824157},{"$f":"-'Acquirer IS'!P31","v":-257.10133934282862},{"$f":"-'Acquirer IS'!R31","v":-301.09562727852273}]
[null,"Plus: Deprec. & Amort..",null,{"$f":"'Target IS'!J17+'Target IS'!J18","v":430.06064000000003},{"$f":"'Target IS'!L17+'Target IS'!L18","v":439.16488480000004},{"$f":"'Target IS'!N17+'Target IS'!N18","v":448.90642673600007},{"$f":"'Target IS'!P17+'Target IS'!P18","v":459.32987660752008},{"$f":"'Target IS'!R17+'Target IS'!R18","v":470.4829679700465},null,"Plus: Deprec. & Amort.",null,{"$f":"'Acquirer IS'!J17+'Acquirer IS'!J18","v":1013.3019},{"$f":"'Acquirer IS'!L17+'Acquirer IS'!L18","v":1094.3660520000001},{"$f":"'Acquirer IS'!N17+'Acquirer IS'!N18","v":1181.9153361600002},{"$f":"'Acquirer IS'!P17+'Acquirer IS'!P18","v":1276.4685630528002},{"$f":"'Acquirer IS'!R17+'Acquirer IS'!R18","v":1378.5860480970243}]
[null,"Less: Gross Capex",null,{"$f":"-'Target CF'!J29","v":16.257580000000001},{"$f":"-'Target CF'!L29","v":17.395610600000005},{"$f":"-'Target CF'!N29","v":18.613303342000005},{"$f":"-'Target CF'!P29","v":19.91623457594001},{"$f":"-'Target CF'!R29","v":21.310370996255809},null,"Less: Gross Capex",null,{"$f":"-'Acquirer CF'!J33","v":878.1949800000001},{"$f":"-'Acquirer CF'!L29","v":948.45057840000015},{"$f":"-'Acquirer CF'!N33","v":1024.3266246720002},{"$f":"-'Acquirer CF'!P29","v":1106.2727546457602},{"$f":"-'Acquirer CF'!R33","v":1194.7745750174211}]
[null,"Less: ∆ NWC",null,{"$f":"'Target CF'!J17+'Target CF'!J18+'Target CF'!J20+'Target CF'!J23+'Target CF'!J25","v":43.595455671232742},{"$f":"'Target CF'!L17+'Target CF'!L18+'Target CF'!L20+'Target CF'!L23+'Target CF'!L25","v":-60.942318103013775},{"$f":"'Target CF'!N17+'Target CF'!N18+'Target CF'!N20+'Target CF'!N23+'Target CF'!N25","v":-65.208280370224799},{"$f":"'Target CF'!P17+'Target CF'!P18+'Target CF'!P20+'Target CF'!P23+'Target CF'!P25","v":-69.772859996140568},{"$f":"'Target CF'!R17+'Target CF'!R18+'Target CF'!R20+'Target CF'!R23+'Target CF'!R25","v":-74.656960195870255},null,"Less:  ∆ NWC",null,{"$f":"'Acquirer CF'!J17+'Acquirer CF'!J18+'Acquirer CF'!J20+'Acquirer CF'!J23+'Acquirer CF'!J24+'Acquirer CF'!J25","v":141.61282805479425},{"$f":"'Acquirer CF'!L17+'Acquirer CF'!L18+'Acquirer CF'!L20+'Acquirer CF'!L23+'Acquirer CF'!L24+'Acquirer CF'!L25","v":-3.7389737556165983},{"$f":"'Acquirer CF'!N17+'Acquirer CF'!N18+'Acquirer CF'!N20+'Acquirer CF'!N23+'Acquirer CF'!N24+'Acquirer CF'!N2","v":-20.862091656065331},{"$f":"'Acquirer CF'!P17+'Acquirer CF'!P18+'Acquirer CF'!P20+'Acquirer CF'!P23+'Acquirer CF'!P24+'Acquirer CF'!P25","v":-39.35505898855115},{"$f":"'Acquirer CF'!R17+'Acquirer CF'!R18+'Acquirer CF'!R20+'Acquirer CF'!R23+'Acquirer CF'!R24+'Acquirer CF'!R25","v":-59.327463707635161}]
[null,"Equals: Free Cash Flow",null,{"$f":"SUM(D5:D9)","v":756.41109967123316},{"$f":"SUM(E5:E9)","v":712.98047841698644},775.26186759961581,843.08496243305831,916.85749453148014,null,"Equals: Free Cash Flow",null,{"$f":"SUM(L5:L9)","v":2784.1622986147931},{"$f":"SUM(M5:M9)","v":2863.2261046491831},3090.8513300951186,3339.196224531906,3610.0576370456824]
{"$rows_left_out":69}