{"text_format":"1","workbook":"xlsx","n_sheets":3,"sheets":["Sheet1","Large Plot","Sheet3"],"not_rendered":{"charts":3,"images":0,"macros":1,"external_links":0,"defined_names":0,"comments":0,"pivot_tables":0},"unopened":[],"bounds":{"document_bytes":16777216,"sheet_cells":100000,"rows_first":2000,"rows_last":500,"rows_between":2000,"halvings":0,"cell_chars":16384,"cell_head_chars":4096},"cells_cut":0,"cells_raw":0,"read":"whole","date_system":"1900"}

{"sheet":"Sheet1","index":0,"n_rows":187,"n_cols":25,"rows_kept":187,"cut":false,"hidden":false,"merged":[]}
[]
[null,null,null,null,null,null,null,"Reaction Kinetics ODE Solver v1.0"]
[null,null,null,null,null,null,null,"Report problems to: smith@scf.che.tohoku.ac.jp"]
[]
[null,"Time",null,null,"Species"]
["Start",0,null,null,1,2,3,4,5,6,7,8,9,10]
["Finish",80,null,"Names: ","Cxyl","Ctol","Ctah","Cta","Cbdh","C4cba","Ctpa"]
["step size",0.5,null,"Initial Concentrations: ",1,0,0,0,0,0,0]
["no of steps",{"$f":"(B7-B6)/B8+1","v":161}]
[null,null,null,null,null,null,"Number of equations: ",7]
[null,null,null,null,null,null,"Reaction pathway",null,null,null,null,null,null,null,null,null,null,null,"Worksheet of individual elements"]
[null,"Reaction Rate",null,"Rate of ","Enter integer + or - values to select k1 to kn for each first-order reaction"]
[null,"Constants",null,"Disappearance",{"$f":"IF(E$7<>\"\",E$7,\"\")","v":"Cxyl"},{"$f":"IF(F$7<>\"\",F$7,\"\")","v":"Ctol"},"Ctah","Cta","Cbdh","C4cba","Ctpa","","","","Disappearance of component \"i\"",1,2,3,4,5,6,7,8,9,10]
["k1",0.22500000000000001,{"$f":"IF(E7<>\"\",E7,\"\")","v":"Cxyl"},"dC1/dt =",-11,null,null,null,null,null,null,null,null,null,{"$f":"CONCATENATE(P14,Q14,R14,S14,T14,U14,V14,W14,X14,Y14)","v":" -k11*Cxyl"},{"$f":"IF($E14>0,\" +k\"&TEXT(ABS($E14),\"0\")&\"*\"&E$7,IF($E14<0,\" -\"&\"k\"&TEXT(ABS($E14),\"0\")&\"*\"&E$7,\"\"))","v":" -k11*Cxyl"},{"$f":"IF($F14>0,\" +k\"&TEXT(ABS($F14),\"0\")&\"*\"&F$7,IF($F14<0,\" -\"&\"k\"&TEXT(ABS($F14),\"0\")&\"*\"&F$7,\"\"))","v":""},{"$f":"IF($G14>0,\" +k\"&TEXT(ABS($G14),\"0\")&\"*\"&G$7,IF($G14<0,\" -\"&\"k\"&TEXT(ABS($G14),\"0\")&\"*\"&G$7,\"\"))","v":""},{"$f":"IF($H14>0,\" +k\"&TEXT(ABS($H14),\"0\")&\"*\"&H$7,IF($H14<0,\" -\"&\"k\"&TEXT(ABS($H14),\"0\")&\"*\"&H$7,\"\"))","v":""},{"$f":"IF($I14>0,\" +k\"&TEXT(ABS($I14),\"0\")&\"*\"&I$7,IF($I14<0,\" -\"&\"k\"&TEXT(ABS($I14),\"0\")&\"*\"&I$7,\"\"))","v":""},{"$f":"IF($J14>0,\" +k\"&TEXT(ABS($J14),\"0\")&\"*\"&J$7,IF($J14<0,\" -\"&\"k\"&TEXT(ABS($J14),\"0\")&\"*\"&J$7,\"\"))","v":""},{"$f":"IF($K14>0,\" +k\"&TEXT(ABS($K14),\"0\")&\"*\"&K$7,IF($K14<0,\" -\"&\"k\"&TEXT(ABS($K14),\"0\")&\"*\"&K$7,\"\"))","v":""},{"$f":"IF($L14>0,\" +k\"&TEXT(ABS($L14),\"0\")&\"*\"&L$7,IF($L14<0,\" -\"&\"k\"&TEXT(ABS($L14),\"0\")&\"*\"&L$7,\"\"))","v":""},{"$f":"IF($M14>0,\" +k\"&TEXT(ABS($M14),\"0\")&\"*\"&M$7,IF($M14<0,\" -\"&\"k\"&TEXT(ABS($M14),\"0\")&\"*\"&M$7,\"\"))","v":""},{"$f":"IF($N14>0,\" +k\"&TEXT(ABS($N14),\"0\")&\"*\"&N$7,IF($N14<0,\" -\"&\"k\"&TEXT(ABS($N14),\"0\")&\"*\"&N$7,\"\"))","v":""}]
["k2",0.105,{"$f":"IF(F7<>\"\",F7,\"\")","v":"Ctol"},"dC2/dt =",1,-7,null,null,null,null,null,null,null,null,{"$f":"CONCATENATE(P15,Q15,R15,S15,T15,U15,V15,W15,X15,Y15)","v":" +k1*Cxyl -k7*Ctol"},{"$f":"IF($E15>0,\" +k\"&TEXT(ABS($E15),\"0\")&\"*\"&E$7,IF($E15<0,\" -\"&\"k\"&TEXT(ABS($E15),\"0\")&\"*\"&E$7,\"\"))","v":" +k1*Cxyl"},{"$f":"IF($F15>0,\" +k\"&TEXT(ABS($F15),\"0\")&\"*\"&F$7,IF($F15<0,\" -\"&\"k\"&TEXT(ABS($F15),\"0\")&\"*\"&F$7,\"\"))","v":" -k7*Ctol"},{"$f":"IF($G15>0,\" +k\"&TEXT(ABS($G15),\"0\")&\"*\"&G$7,IF($G15<0,\" -\"&\"k\"&TEXT(ABS($G15),\"0\")&\"*\"&G$7,\"\"))","v":""},{"$f":"IF($H15>0,\" +k\"&TEXT(ABS($H15),\"0\")&\"*\"&H$7,IF($H15<0,\" -\"&\"k\"&TEXT(ABS($H15),\"0\")&\"*\"&H$7,\"\"))","v":""},{"$f":"IF($I15>0,\" +k\"&TEXT(ABS($I15),\"0\")&\"*\"&I$7,IF($I15<0,\" -\"&\"k\"&TEXT(ABS($I15),\"0\")&\"*\"&I$7,\"\"))","v":""},{"$f":"IF($J15>0,\" +k\"&TEXT(ABS($J15),\"0\")&\"*\"&J$7,IF($J15<0,\" -\"&\"k\"&TEXT(ABS($J15),\"0\")&\"*\"&J$7,\"\"))","v":""},{"$f":"IF($K15>0,\" +k\"&TEXT(ABS($K15),\"0\")&\"*\"&K$7,IF($K15<0,\" -\"&\"k\"&TEXT(ABS($K15),\"0\")&\"*\"&K$7,\"\"))","v":""},{"$f":"IF($L15>0,\" +k\"&TEXT(ABS($L15),\"0\")&\"*\"&L$7,IF($L15<0,\" -\"&\"k\"&TEXT(ABS($L15),\"0\")&\"*\"&L$7,\"\"))","v":""},{"$f":"IF($M15>0,\" +k\"&TEXT(ABS($M15),\"0\")&\"*\"&M$7,IF($M15<0,\" -\"&\"k\"&TEXT(ABS($M15),\"0\")&\"*\"&M$7,\"\"))","v":""},{"$f":"IF($N15>0,\" +k\"&TEXT(ABS($N15),\"0\")&\"*\"&N$7,IF($N15<0,\" -\"&\"k\"&TEXT(ABS($N15),\"0\")&\"*\"&N$7,\"\"))","v":""}]
["k3",0.124,{"$f":"IF(G7<>\"\",G7,\"\")","v":"Ctah"},"dC3/dt =",2,null,-3,null,null,null,null,null,null,null," +k2*Cxyl -k3*Ctah"," +k2*Cxyl",""," -k3*Ctah","","","","","","",""]
["k4",1.4999999999999999E-2,{"$f":"IF(H7<>\"\",H7,\"\")","v":"Cta"},"dC4/dt =",2,null,3,-4,null,null,null,null,null,null," +k2*Cxyl +k3*Ctah -k4*Cta"," +k2*Cxyl",""," +k3*Ctah"," -k4*Cta","","","","","",""]
["k5",0.123,{"$f":"IF(I7<>\"\",I7,\"\")","v":"Cbdh"},"dC5/dt =",1,7,null,null,-8,null,null,null,null,null," +k1*Cxyl +k7*Ctol -k8*Cbdh"," +k1*Cxyl"," +k7*Ctol","",""," -k8*Cbdh","","","","",""]
["k6",0.18,{"$f":"IF(J7<>\"\",J7,\"\")","v":"C4cba"},"dC6/dt =",2,null,3,4,null,-5,null,null,null,null," +k2*Cxyl +k3*Ctah +k4*Cta -k5*C4cba"," +k2*Cxyl",""," +k3*Ctah"," +k4*Cta",""," -k5*C4cba","","","",""]
["k7",7.5999999999999998E-2,{"$f":"IF(K7<>\"\",K7,\"\")","v":"Ctpa"},"dC7/dt =",2,null,3,4,null,5,-6,null,null,null," +k2*Cxyl +k3*Ctah +k4*Cta +k5*C4cba -k6*Ctpa"," +k2*Cxyl",""," +k3*Ctah"," +k4*Cta",""," +k5*C4cba"," -k6*Ctpa","","",""]
["k8",0.13800000000000001,{"$f":"IF(L7<>\"\",L7,\"\")","v":""},"dC8/dt =",null,null,null,null,null,null,null,null,null,null,"","","","","","","","","","",""]
["k9",null,{"$f":"IF(M7<>\"\",M7,\"\")","v":""},"dC9/dt =",null,null,null,null,null,null,null,null,null,null,"","","","","","","","","","",""]
["k10",null,{"$f":"IF(N7<>\"\",N7,\"\")","v":""},"dC10/dt =",null,null,null,null,null,null,null,null,null,null,"","","","","","","","","","",""]
["user k11",{"$f":"B14+B15","v":0.33}]
["user k12",null,null,null,null,null,"Concentrations versus time"]
["user k13",null,null,"time [min]",{"$f":"IF(E$7<>\"\",E$7,\"\")","v":"Cxyl"},{"$f":"IF(F$7<>\"\",F$7,\"\")","v":"Ctol"},"Ctah","Cta","Cbdh","C4cba","Ctpa","","",""]
["user k14",null,null,0,1,0,0,0,0,0,0]
["user k15",null,null,0.5,0.84789469585937494,0.1017090759046875,4.68871885496875E-2,4.9717243110664056E-2,0.102068888165625,4.8564102627031237E-2,4.9362222623984375E-2]
[null,null,null,1,0.71892541526646203,0.1841552296266058,8.3823864956927868E-2,9.4308814698905563E-2,0.18547103612544055,8.9948283296855391E-2,9.2890804886376382E-2]
[null,null,null,1.5,0.60957304632293174,0.25040986244629987,0.11249300830985835,0.13436733755863292,0.25311859922744961,0.12508503690135131,0.13119106810845343]
[null,null,null,2,0.51685375271605494,0.30307192650605114,0.13431142060185897,0.17040683935856282,0.30748101551895429,0.15478310059222963,0.16480013216001996]
[null,null,null,2.5,0.43823755546295601,0.34433998343367755,0.15047082609538848,0.20287401100557029,0.35065213966350334,0.17974468721565517,0.19419574477089019]
[null,null,null,3,0.37157929880341906,0.37607329513666221,0.16197268243791374,0.23215779443204176,0.38440718623190312,0.20058022312110974,0.21980384138058837]
[null,null,null,3.5,0.31506011654656485,0.39984361530502205,0.16965766221910444,0.2585975513928232,0.41025103076474856,0.21782096059585615,0.24200502757434658]
[null,null,null,4,0.26713780169666884,0.41697909635759239,0.17423061770369941,0.28249002674122092,0.4294591816043753,0.23192977952791693,0.261140146611964]
[null,null,null,4.5,0.22650472512213907,0.42860151136794455,0.17628171772817747,0.30409528732594504,0.44311253589173744,0.24331044566988122,0.27751506956772765]
[null,null,null,5,0.19205215501814743,0.43565780804088478,0.17630434083307595,0.32364179023195827,0.4521268638741115,0.25231555278588158,0.29140482446443927]
[null,null,null,5.5,0.16284000356824965,0.43894685709950326,0.17471021975189985,0.34133071083179251,0.45727782215642848,0.2592533419315769,0.30305716290995605]
[null,null,null,6,0.13807117529924057,0.43914212626446247,0.17184225696321059,0.35733964138736163,0.45922217483827665,0.2643935622233326,0.31269564762870894]
[null,null,null,6.5,0.11706981718729603,0.43681089978217102,0.16798536707529302,0.37182575420917297,0.45851579829137307,0.2679725129189392,0.32052233149856435]
[null,null,null,7,9.9262877038335001E-2,0.43243056915168188,0.16337564760666384,0.38492850918523941,0.45562895783451562,0.27019738579740948,0.32672008789548546]
[null,null,null,7.5,8.4164466936545598E-2,0.42640244073821287,0.15820813377010207,0.39677197345019122,0.45095927036865402,0.27125000912924663,0.33145464301030564]
[null,null,null,8,7.1362605095328754E-2,0.41906343816217406,0.15264335390757136,0.40746681074901375,0.44484270412061511,0.27129007949576395,0.33487635307588998]
[null,null,null,8.5,6.0507974343036459E-2,0.41069601986644266,0.14681286919403408,0.41711198938213817,0.43756291329474262,0.27045795494340585,0.33712176291098561]
[null,null,null,9,5.1304390502655763E-2,0.40153658352269983,0.14082395322730681,0.42579625026411089,0.42935916019273157,0.26887707210460338,0.33831497666464355]
[null,null,null,9.5,4.350072058149991E-2,0.39178258760988321,0.13476354338363944,0.43359937038732715,0.42043303899993695,0.26665604069042037,0.33856886697612942]
[null,null,null,10,3.6884030247114521E-2,0.38159858545646885,0.12870157569586951,0.4405932516862246,0.41095418290567381,0.2638904609160404,0.33798614481767031]
[null,null,null,10.5,3.1273773608445153E-2,0.37112133732717312,0.12269379795276508,0.44684286080248059,0.40106510863880246,0.26066450274926301,0.33666030894950827]
[null,null,null,11,2.6516866762107551E-2,0.36046414094299034,0.11678414125815118,0.45240704143653199,0.39088532910636509,0.25705228019752541,0.33467649109407921]
[null,null,null,11.5,2.248351067840075E-2,0.34972049946382044,0.11100671803120082,0.4573392177320077,0.380514844984706,0.25311904902029064,0.33211221054882339]
[null,null,null,12,1.9063649448513614E-2,0.33896722785241051,0.10538750403960043,0.46168800438997187,0.37003710928881561,0.24892225214345953,0.32903804993762048]
[null,null,null,12.5,1.6163967251117191E-2,0.32826708318271852,9.9945753250918534E-2,0.46549773687505269,0.35952154467824865,0.24451243355259861,0.32551826209203011]
[null,null,null,13,1.3705342096266908E-2,0.31767099143606287,9.4695186823411825E-2,0.4688089330926753,0.34902568115823202,0.23993403846043046,0.3216113166071537]
[null,null,null,13.5,1.162068686836292E-2,0.30721993228923872,8.96449912313554E-2,0.4716586962323836,0.33859697157296531,0.23522611500330348,0.31737039339222517]
[null,null,null,14,9.8531187579276105E-3,0.29694653403890453,8.4800655158541446E-2,0.47408106704138031,0.32827433358519525,0.23042293055512314,0.31284382949853767]
[null,null,null,14.5,8.3544071325193335E-3,0.28687642287052706,8.0164670249965472E-2,0.47610733257656723,0.31808945945498129,0.22555451389936124,0.30807552462790289]
[null,null,null,15,7.0836574947128732E-3,0.27702936395144184,7.5737116961380399E-2,0.47776629744998145,0.30806792867025679,0.22064713292261759,0.30310530997893659]
[null,null,null,15.5,6.0061956170515537E-3,0.26742022612249194,7.1516153483760725E-2,0.47908452270399521,0.29823015317197238,0.21572371614633895,0.29796928445530207]
[null,null,null,16,5.0926214059918385E-3,0.25805979712555033,6.7498422955268159E-2,0.48008653670556023,0.28859218041282864,0.21080422526235246,0.29270012172209359]
[null,null,null,16.5,4.3180066781603925E-3,0.2489554722029825,6.3679391831152843E-2,0.48079502181327233,0.27916637566837815,0.20590598485367539,0.28732735113900226]
[null,null,null,17,3.661214959097556E-3,0.24011183542782463,6.0053630297819585E-2,0.48123098003025944,0.26996200177873325,0.20104397463984261,0.28187761520928906]
[null,null,null,17.5,3.1043247442198163E-3,0.23153115017522849,5.6615043936487523E-2,0.4814138803955611,0.26098571175018109,0.19623108886469812,0.27637490585135033]
[null,null,null,18,2.6321404848489932E-3,0.22321377264607425,5.335706441822903E-2,0.48136179047464822,0.25224196731399812,0.19147836682634331,0.27084078151590912]
[null,null,null,18.5,2.2317779558601852E-3,0.21515850023434513,5.0272805806484591E-2,0.48109149397573436,0.24373339456133858,0.1867951980185216,0.26529456692909614]
[null,null,null,19,1.8923126911097295E-3,0.207362864733034,4.7355192022177618E-2,0.48061859623383019,0.23546108609454422,0.18218950489722699,0.25975353703357118]
[null,null,null,19.5,1.6044818936993195E-3,0.19982337884995643,4.4597060162121074E-2,0.47995761906167927,0.22742485771104209,0.17766790589476705,0.25423308652104221]
[null,null,null,20,1.3604316872700584E-3,0.19253574321328271,4.1991243629630949E-2,0.4791220862595032,0.2196234664275464,0.17323586096654456,0.24874688619556512]
[null,null,null,20.5,1.1535028117153024E-3,0.18549501995160511,3.9530638416891563E-2,0.47812460089853814,0.2120547956268094,0.16889780166550006,0.24330702727405748]
[null,null,null,21,9.7804891571228033E-4,0.17869577800502406,3.7208255354491418E-2,0.47697691534213948,0.2047160122389014,0.16465724748871291,0.23792415461533772]
[null,null,null,21.5,8.2928248792345542E-4,0.17213221453671265,3.5017260700115876E-2,0.47568999483891805,0.19760370013039039,0.16051691002433491,0.23260758976900933]
[null,null,null,22,7.03144222879364E-4,0.16579825614720592,3.2951007063312263E-2,0.47427407541168931,0.19071397324786246,0.15647878623992309,0.22736544464837383]
[null,null,null,22.5,5.9619225700357494E-4,0.15968764302803162,3.1003056346081123E-2,0.47273871667119222,0.18404257153003681,0.1525442420911686,0.22220472655536078]
[null,null,null,23,5.0550825242576052E-4,0.15379399871179819,2.9167196110934178E-2,0.47109285010221769,0.17758494215091669,0.14871408748942636,0.21713143521859221]
[null,null,null,23.5,4.2861776594494436E-4,0.14811088766937844,2.7437450561486009E-2,0.46934482329997301,0.17133630827279753,0.14498864354429797,0.21215065244678746]
[null,null,null,24,3.6342273029581337E-4,0.14263186266026456,2.5808087129248942E-2,0.46750244057450585,0.16529172716219043,0.14136780289121667,0.20726662494761558]
[null,null,null,24.5,3.0814420537255235E-4,0.13735050345009969,2.4273619498685277E-2,0.46557300028937126,0.15944613924505049,0.13785108382131755,0.20248284081584345]
[null,null,null,25,2.6127383729518904E-4,0.13226044826182645,2.2828807766167983E-2,0.46356332925622501,0.15379440944268896,0.13443767884995694,0.19780210015339084]
[null,null,null,25.5,2.2153270080941615E-4,0.12735541911706119,2.1468656313437206E-2,0.4614798144686213,0.14833136193009305,0.13112649828945874,0.1932265802469961]
[null,null,null,26,1.8783640197570582E-4,0.12262924204646146,2.0188409879134284E-2,0.45932843242509624,0.14305180928872632,0.1279162093296298,0.18875789569603285]
[null,null,null,26.5,1.592654889245104E-4,0.11807586299713506,1.8983548230266958E-2,0.45711477626287722,0.13795057688170068,0.12480527107511835,0.18439715385310418]
[null,null,null,27,1.3504036329254241E-4,0.11368936013741385,1.7849779766654167E-2,0.45484408089862982,0.13302252315664809,0.12179196594077596,0.18014500591295635]
[null,null,null,27.5,1.1450000776266976E-4,0.10946395315108415,1.6783034333520901E-2,0.45252124635099078,0.12826255647741158,0.11887442776395578,0.17600169396064336]
[null,null,null,28,9.7083949257824952E-5,0.10539401002146033,1.5779455468773202E-2,0.45015085940077526,0.12366564899705086,0.11605066695539097,0.17196709426743467]
[null,null,null,28.5,8.2316965628790486E-5,0.1014740517279934,1.4835392270649415E-2,0.44773721372829001,0.11922684800926683,0.11331859297730686,0.1680407571024331]
[null,null,null,29,6.9796118535889933E-5,9.7698755212288171E-2,1.3947391037204306E-2,0.44528432865279455,0.11494128515119841,0.1106760344081774,0.16422194330903875]
[null,null,null,29.5,5.9179758698153277E-5,9.406295491465283E-2,1.3112186800411468E-2,0.44279596658654241,0.11080418377594038,0.10812075682756543,0.16050965787807117]
[null,null,null,30,5.0178203502401873E-5,9.0561643135089076E-2,1.2326694853698035E-2,0.44027564930475621,0.10681086476663862,0.1056504787313777,0.15690268073338337]
[null,null,null,30.5,4.2545832597438863E-5,8.7189969432650255E-2,1.158800235171879E-2,0.4377266731231354,0.10295675102441768,0.1032628856672667,0.15339959493102961]
[null,null,null,31,3.6074385790289309E-5,8.3943239243245885E-2,1.0893360044512161E-2,0.4351521230658848,9.9237370828653346E-2,0.10095564276151556,0.14999881245936683]
[null,null,null,31.5,3.0587280367971112E-5,8.0816911867319347E-2,1.0240174194332048E-2,0.43255488609962933,9.5648360239339189E-2,9.8726405792285407E-2,0.14669859781476929]
[null,null,null,32,2.5934792784766298E-5,7.7806597954579268E-2,9.6259987119715132E-3,0.42993766350181878,9.2185464686767124E-2,9.6572830949357119E-2,0.14349708951583273]
[null,null,null,32.5,2.1989973240415334E-5,7.4908056592451658E-2,9.0485275399107851E-3,0.42730298242620796,8.8844539872814238E-2,9.4492583407261882E-2,0.14039231970795515]
[null,null,null,33,1.8645181672637754E-5,7.2117192087570697E-2,8.5055873018144296E-3,0.42465320672263218,8.5621552090264119E-2,9.2483344826793656E-2,0.1373822319999401]
[null,null,null,33.5,1.5809150643563982E-5,6.9430050514957264E-2,7.9951302315019006E-3,0.42199054706349598,8.2512578051333829E-2,9.054281988918135E-2,0.13446469766471297]
[null,null,null,34,1.3404494976719726E-5,6.6842816097137242E-2,7.5152273892949064E-3,0.41931707042508853,7.9513804303540672E-2,8.8668741957535643E-2,0.13163753032731842]
[null,null,null,34.5,1.1365600191434293E-5,6.4351807464979482E-2,7.0640621694122371E-3,0.41663470896796945,7.6621526299895631E-2,8.6858877951461161E-2,0.12889849925502811]
[null,null,null,35,9.6368321175754337E-6,6.1953473843190617E-2,6.6399240986758324E-3,0.41394526835717749,7.3832147180873386E-2,8.5111032512836804E-2,0.12624534135659243]
[null,null,null,35.5,8.1710188373794782E-6,5.9644391195943142E-2,6.2412029240745681E-3,0.41125043555986363,7.1142176317444211E-2,8.3423051533627043E-2,0.12367577199037606]
[null,null,null,36,6.928163531981097E-6,5.7421258361821444E-2,5.8663829845891167E-3,0.40855178615509136,6.8548227657458619E-2,8.179282511011661E-2,0.12118749467429281]
[null,null,null,36.5,5.8743531108131258E-6,5.5280893201969085E-2,5.5140378610153938E-3,0.40585079118795431,6.6047017911679301E-2,8.0218289982091379E-2,0.11877820978406695]
[null,null,null,37,4.9808328442634687E-6,5.3220228780858081E-2,5.1828252962538412E-3,0.40314882359779847,6.3635364610610506E-2,7.8697431510158428E-2,0.11644562232036862]
[null,null,null,37.5,4.2232217496131592E-6,5.1236309595347758E-2,4.871482377588339E-3,0.40044716424818316,6.1310184058857929E-2,7.7228285239554439E-2,0.11418744881977221]
[null,null,null,38,3.5808473209349471E-6,4.9326287864548596E-2,4.5788209718042186E-3,0.39774700758424453,5.9068489209957338E-2,7.5808938094385561E-2,0.11200142347924577]
[null,null,null,38.5,3.0361814501029951E-6,4.7487419890362079E-2,4.303723403541123E-3,0.39504946694132215,5.6907387481345974E-2,7.4437529242231917E-2,0.10988530355897323]
[null,null,null,39,2.5743621472089553E-6,4.5717062496353392E-2,4.0451383670027088E-3,0.39235557952705191,5.4824078526342031E-2,7.3112250665397227E-2,0.10783687412371902]
[null,null,null,39.5,2.1827880098396245E-6,4.4012669550762683E-2,3.8020770610173427E-3,0.38966631109760724,5.2815851977577793E-2,7.1831347471755444E-2,0.10585395217864753]
[null,null,null,40,1.850774375728459E-6,4.2371788577916868E-2,3.573609537433564E-3,0.38698256034736694,5.0880085174245866E-2,7.0593117975111697E-2,0.10393439025148937]
[null,null,null,40.5,1.5692617764126065E-6,4.0792057461019514E-2,3.3588612529174109E-3,0.38430516302999401,4.9014240883718078E-2,6.9395913572226242E-2,0.10207607946918593]
[null,null,null,41,1.3305687366351094E-6,3.9271201238231072E-2,3.157009814375921E-3,0.38163489582771493,4.7215865026542188E-2,6.8238138441124641E-2,0.10027695217362764]
[null,null,null,41.5,1.128182174269219E-6,3.7807028993071347E-2,2.9672819084458112E-3,0.37897247998448125,4.5482584412477912E-2,6.7118249083011866E-2,9.8534984117815111E-2]
[null,null,null,42,9.5657968152596782E-7,3.6397430839451426E-2,2.7889504057448515E-3,0.3763185847176711,4.3812104494071864E-2,6.6034753728003479E-2,9.6848196280701099E-2]
[null,null,null,42.5,8.1107883813271826E-7,3.5040375001049347E-2,2.6213316308745312E-3,0.37367383042203689,4.2202207143264739E-2,6.4986211622965612E-2,9.5214656336103959E-2]
[null,null,null,43,6.8770944477651635E-7,3.3733904984260973E-2,2.4637827894769824E-3,0.37103879167872211,4.0650748455652738E-2,6.3971232218001037E-2,9.3632479808405333E-2]
[null,null,null,43.5,5.8310519051840402E-7,3.2476136843568253E-2,2.3156995439791773E-3,0.36841400008134956,3.9155656586269599E-2,6.2988474266516464E-2,9.2099830945246694E-2]
[null,null,null,44,4.944117981686251E-7,3.1265256537855404E-2,2.176513729996961E-3,0.36579994689041873,3.7714929620100313E-2,6.2036644852343607E-2,9.0614923335109024E-2]
[null,null,null,44.5,4.1920914123747306E-7,3.0099517375957879E-2,2.045691205715456E-3,0.36319708552653845,3.6326633479968826E-2,6.1114498356051081E-2,8.9176020295487657E-2]
[null,null,null,45,3.55445207311017E-7,2.8977237549537849E-2,1.9227298269067759E-3,0.36060583391235779,3.498889987394832E-2,6.0220835371365286E-2,8.7781435055349979E-2]
[null,null,null,45.5,3.0138010594764725E-7,2.7896797751234995E-2,1.807157540587542E-3,0.35802657667243909,3.3699924284013721E-2,5.9354501581506063E-2,8.6429530753679068E-2]
[null,null,null,46,2.5553859327054656E-7,2.6856638875934549E-2,1.6985305906548802E-3,0.35545966719973898,3.2457963997283755E-2,5.8514386604227996E-2,8.5118720274151613E-2]
[null,null,null,46.5,2.166698178214626E-7,2.5855259802919597E-2,1.5964318291683988E-3,0.35290542959682442,3.1261336180876231E-2,5.7699422813432884E-2,8.3847465934366469E-2]
[null,null,null,47,1.8371318928363523E-7,2.4891215256626197E-2,1.5004691272656036E-3,0.35036416049944535,3.0108416001119437E-2,5.6908584144375086E-2,8.2614279046523006E-2]
[null,null,null,47.5,1.5576943875300368E-7,2.3963113743693181E-2,1.4102738800081578E-3,0.34783613078961478,2.8997634787618607E-2,5.6140884888712751E-2,8.1417719365038596E-2]
[null,null,null,48,1.3207608089566359E-7,2.3069615563989863E-2,1.3254995997555564E-3,0.34532158720490541,2.7927478242465015E-2,5.5395378484957902E-2,8.0256394435285455E-2]
[null,null,null,48.5,1.1198660844132689E-7,2.2209430893310962E-2,1.245820592950592E-3,0.34282075385025901,2.6896484694692014E-2,5.4671156309241319E-2,7.9128958856412454E-2]
[null,null,null,49,9.495285130468178E-8,2.1381317935446075E-2,1.1709307154771384E-3,0.34033383361821795,2.5903243399923767E-2,5.3967346470728574E-2,7.8034113470090788E-2]
[null,null,null,49.5,8.0510018977963618E-8,2.0584081141358807E-2,1.100542202015089E-3,0.33786100952312642,2.4946392885025575E-2,5.3283112615497168E-2,7.6970604485978561E-2]
[null,null,null,50,6.8264018054952977E-8,1.9816569493246158E-2,1.0343845650697694E-3,0.33540244595450897,2.4024619337446654E-2,5.261765274220654E-2,7.5937222553732378E-2]
[null,null,null,50.5,5.7880698826843239E-8,1.9077674851290354E-2,9.7220355959386803E-4,0.33295828985451642,2.3136655038844912E-2,5.1970198032458934E-2,7.4932801790499229E-2]
[null,null,null,51,4.9076737527914332E-8,1.8366330360961712E-2,9.1376020934910414E-4,0.33052867182403062,2.2281276842496492E-2,5.134001169835619E-2,7.3956218771994653E-2]
[null,null,null,51.5,4.1611905440001298E-8,1.7681508918781168E-2,8.5882989137270706E-4,0.32811370716173993,2.1457304693918915E-2,5.0726387849401547E-2,7.3006391494508355E-2]
[null,null,null,52,3.5282513907178976E-8,1.7022221694503677E-2,8.0720147512064206E-4,0.32571349684023521,2.0663600194074015E-2,5.0128650380573903E-2,7.20822783144726E-2]
[null,null,null,52.5,2.9915856398481689E-8,1.6387516707738352E-2,7.5867651305570817E-4,0.32332812842293024,1.9899065204464113E-2,4.954615188311158E-2,7.1182876871577275E-2]
[null,null,null,53,2.536549596236337E-8,1.5776477457076971E-2,7.1306847963454104E-4,0.32095767692537858,1.9162640493391E-2,4.8978272579280599E-2,7.0307223000815156E-2]
[null,null,null,53.5,2.1507269484330294E-8,1.5188221599858918E-2,6.7020205582355677E-4,0.31860220562434377,1.8453304422610953E-2,4.8424419282166828E-2,6.9454389638287983E-2]
[null,null,null,54,1.8235899718181851E-8,1.4621899680757429E-2,6.2991245644037708E-4,0.31626176681777507,1.7770071673589651E-2,4.7884024381319515E-2,6.8623485725094996E-2]
[null,null,null,54.5,1.5462122645269864E-8,1.4076693907428507E-2,5.9204479777468855E-4,0.31393640253865102,1.7111992012537412E-2,4.7356544854883657E-2,6.7813655113158192E-2]
[null,null,null,55,1.3110251777651446E-8,1.3551816971520129E-2,5.5645350309121576E-4,0.31162614522547299,1.6478149093387007E-2,4.6841461308688777E-2,6.7024075476408596E-2]
[null,null,null,55.5,1.1116112943651604E-8,1.3046510913394812E-2,5.230017437579317E-4,0.30933101835202353,1.5867659297862866E-2,4.6338277042609712E-2,6.625395723036423E-2]
[null,null,null,56,9.4252932034959391E-9,1.256004602897328E-2,4.9156091387519074E-4,0.30705103701884567,1.5279670611781093E-2,4.5846517144380004E-2,6.5502542462769126E-2]
[null,null,null,56.5,7.9916561141636243E-9,1.2091719817160632E-2,4.6201013640653407E-4,0.30478620850875143,1.4713361536714062E-2,4.5365727610918408E-2,6.476910387763242E-2]
[null,null,null,57,6.7760828303314811E-9,1.1640855966368853E-2,4.3423579892986659E-4,0.30253653280852771,1.4167940036150697E-2,4.4895474497122868E-2,6.4052943754704258E-2]
[null,null,null,57.5,5.7454046905418443E-9,1.1206803378700907E-2,4.0813111723890299E-4,0.30030200309887789,1.364264251528392E-2,4.4435343091992728E-2,6.3353392926149721E-2]
[null,null,null,58,4.8714981626760038E-9,1.0788935230411545E-2,3.8359572512958401E-4,0.29808260621451343,1.3136732833559385E-2,4.398493712185772E-2,6.2669809771930179E-2]
[null,null,null,58.5,4.1305174530216742E-9,1.0386648067308732E-2,3.6053528880491042E-4,0.29587832307619522,1.2649501349124535E-2,4.3543877980420587E-2,6.2001579235172882E-2]
[null,null,null,59,3.5022438395716526E-9,9.9993609338068275E-3,3.3886114442466155E-4,0.29368912909641526,1.2180263994323766E-2,4.3111803985257817E-2,6.1348111858601298E-2]
[null,null,null,59.5,2.969533975178976E-9,9.6265145343886454E-3,3.1848995741406787E-4,0.29151499456030772,1.1728361381393836E-2,4.2688369660369159E-2,6.0708842842910025E-2]
[null,null,null,60,2.5178521067284589E-9,9.267570426278007E-3,2.9934340222799243E-4,0.28935588498328235,1.1293157937523541E-2,4.2273245044320652E-2,6.0083231127797114E-2]
[null,null,null,60.5,2.1348734462534132E-9,8.9220102421675856E-3,2.8134786134482998E-4,0.28721176144678345,1.0874041068452621E-2,4.1866115023486819E-2,5.9470758496211994E-2]
[null,null,null,61,1.8101478714092935E-9,8.5893349418885972E-3,2.6443414233742486E-4,0.28508258091349342,1.0470420349797048E-2,4.1466678689865005E-2,5.8870928702237882E-2]
[null,null,null,61.5,1.534814778889078E-9,8.2690640919493314E-3,2.4853721193709814E-4,0.28296829652321953,1.0081726745300744E-2,4.1074648722907822E-2,5.8283266622902022E-2]
[null,null,null,62,1.3013613101466287E-9,7.9607351719085621E-3,2.3359594607160633E-4,0.28086885787062887,9.7074118512275927E-3,4.0689750794797939E-2,5.7707317434094421E-2]
[null,null,null,62.5,1.1034173522699336E-9,7.6639029065876645E-3,2.1955289491875805E-4,0.27878421126592584,9.3469471661219369E-3,4.0311722998572073E-2,5.7142645810675158E-2]
[null,null,null,63,9.3558172030887214E-10,7.3781386231617273E-3,2.0635406207471568E-4,0.27671429997950087,8.9998233851806761E-3,3.9940315298488085E-2,5.6588835150760096E-2]
[null,null,null,63.5,7.9327477819288197E-10,7.1030296322051704E-3,1.939486969899096E-4,0.27465906447151672,8.6655497184954001E-3,3.9575289002019634E-2,5.6045486824095186E-2]
[null,null,null,64,6.7261347678876679E-10,6.8381786318013572E-3,1.8228909987619426E-4,0.27261844260734125,8.3436532324386511E-3,3.9216416252856809E-2,5.5512219444358385E-2]
[null,null,null,64.5,5.7030539933272824E-10,6.5832031338584991E-3,1.713304383365625E-4,0.27059236985967977,8.0336782134843021E-3,3.8863479544287975E-2,5.4988668165166038E-2]
[null,null,null,65,4.8355892311418299E-10,6.3377349118057744E-3,1.6103057501358248E-4,0.26858077949821035,7.7351855537681679E-3,3.85162712523376E-2,5.4474483999505538E-2]
[null,null,null,65.5,4.1000704604398711E-10,6.1014194688740978E-3,1.5134990559489969E-4,0.26658360276747511,7.4477521577111325E-3,3.8174593188036621E-2,5.3969333162268436E-2]
[null,null,null,66,3.476427996056672E-10,5.8739155261953889E-3,1.4225120655380764E-4,0.26460076905373692,7.1709703690433935E-3,3.7838256168205679E-2,5.3472896435516698E-2]
[null,null,null,66.5,2.9476448583934885E-10,5.6548945299825428E-3,1.3369949204018657E-4,0.2626322060414672,6.9044474175846892E-3,3.7507079604137163E-2,5.2984868556079166E-2]
[null,null,null,67,2.4992924407089976E-10,5.4440401770796424E-3,1.2566187937217683E-4,0.26067783986009119,6.6478048851516345E-3,3.7180891107569232E-2,5.2504957625045132E-2]
[null,null,null,67.5,2.1191368038785904E-10,5.2410479581982807E-3,1.1810746261192662E-4,0.25873759522157846,6.4006781899794835E-3,3.6859526113353386E-2,5.2032884538696318E-2]
[null,null,null,68,1.7968048558090455E-10,5.0456247181812569E-3,1.1100719373975374E-4,0.25681139554943205,6.1627160890617054E-3,3.6542827518226864E-2,5.1568382440397575E-2]
[null,null,null,68.5,1.5235013067348589E-10,4.8574882326593485E-3,1.0433377097020772E-4,0.25489916309959565,5.9335801978267037E-3,3.6230645335111854E-2,5.1111196192949397E-2]
[null,null,null,69,1.2917686771153135E-10,4.6763668004904295E-3,9.8061533780919918E-5,0.25300081907376715,5.7129445265867752E-3,3.5922836362374873E-2,5.0661081870891828E-2]
[null,null,null,69.5,1.0952838096033559E-10,4.5019988513928929E-3,9.2166364250889974E-5,0.25111628372557754,5.5004950332100105E-3,3.5619263867492014E-2,5.021780627223902E-2]
[null,null,null,70,9.2868533262333505E-11,4.3341325682071984E-3,8.6625594329074905E-5,0.24924547646006695,5.2959291914811829E-3,3.5319797284578333E-2,4.9781146449116208E-2]
[null,null,null,70.5,7.8742736765372521E-11,4.1725255232404231E-3,8.1417918676913293E-5,0.24738831592686242,5.098955574632847E-3,3.5024311925253064E-2,4.935088925676618E-2]
[null,null,null,71,6.676554884081036E-11,4.0169443281689648E-3,7.6523312749818623E-5,0.24554472010743919,4.909293453542761E-3,3.4732688702325785E-2,4.8926830920389651E-2]
[null,null,null,71.5,5.6610154728263147E-11,3.8671642969940832E-3,7.1922955802794598E-5,0.24371460639682316,4.7266724091083933E-3,3.4444813865802615E-2,4.8508776619283767E-2]
[null,null,null,72,4.7999449925872838E-11,3.7229691215637656E-3,6.7599158524236924E-5,0.24189789168007111,4.5508319583236661E-3,3.4160578750725458E-2,4.8096540087744236E-2]
[null,null,null,72.5,4.0698478996315253E-11,3.5841505591925242E-3,6.3535295019763265E-5,0.24009449240384514,4.3815211935971819E-3,3.3879879536371553E-2,4.7689943232199813E-2]
[null,null,null,73,3.4508024470519883E-11,3.4505081319281595E-3,5.9715738884624072E-5,0.23830432464337833,4.2184984348650157E-3,3.3602617016354717E-2,4.7288815764052333E-2]
[null,null,null,73.5,2.9259170913139325E-11,3.3218488370313319E-3,5.6125803118954324E-5,0.2365273041651112,4.0615308940646702E-3,3.3328696379183974E-2,4.6892994847701375E-2]
[null,null,null,74,2.4808695822493738E-11,3.1979868682499449E-3,5.275168365489164E-5,0.23476334648526131,3.9103943515500471E-3,3.3058026998849264E-2,4.6502324763239518E-2]
[null,null,null,74.5,2.1035161599081078E-11,3.0787433474859182E-3,4.9580406278464467E-5,0.233012366924573,3.7648728440402186E-3,3.2790522235018098E-2,4.6116656583312092E-2]
[null,null,null,75,1.7835601946405654E-11,2.9639460664669191E-3,4.6599776742199469E-5,0.23127428065947883,3.6247583637074288E-3,3.2526099242440848E-2,4.573584786364409E-2]
[null,null,null,75.5,1.5122712287816499E-11,2.8534292380500582E-3,4.379833387665922E-5,0.22954900276989093,3.4898505680220882E-3,3.2264678789176118E-2,4.5359762346746192E-2]
[null,null,null,76,1.2822467535847003E-11,2.7470332567984547E-3,4.1165305520646789E-5,0.22783644828382696,3.3599564999845762E-3,3.200618508326121E-2,4.4988269678322153E-2]
[null,null,null,76.5,1.0872102211473705E-11,2.6446044684849527E-3,3.8690567100647214E-5,0.22613653221906319,3.2348903183853964E-3,3.1750545607465909E-2,4.4621245135910065E-2]
[null,null,null,77,9.2183977979495347E-12,2.5459949481901624E-3,3.6364602700258326E-5,0.22444916962199546,3.1144730377466665E-3,3.1497690961780948E-2,4.4258569369301129E-2]
[null,null,null,77.5,7.8162305972031526E-12,2.4510622866743964E-3,3.4178468469934405E-5,0.2227742756038783,2.9985322776090785E-3,3.1247554713305311E-2,4.3900128152290809E-2]
[null,null,null,78,6.6273404649823082E-12,2.3596693847150229E-3,3.2123758236362102E-5,0.22111176537460178,2.8869020208392958E-3,3.1000073253208905E-2,4.3545812145328634E-2]
[null,null,null,78.5,5.6192868279127034E-12,2.2716842551122464E-3,3.0192571179243363E-5,0.21946155427415615,2.7794223806433239E-3,3.0755185660459546E-2,4.3195516668644796E-2]
[null,null,null,79,4.7645634958996334E-12,2.186979832077406E-3,2.8377481451207694E-5,0.21782355780192555,2.6759393759816408E-3,3.0512833572014939E-2,4.2849141485443339E-2]
[null,null,null,79.5,4.0398481162585E-12,2.105433787728532E-3,2.667150962404584E-5,0.21619769164394351,2.5763047150918696E-3,3.0272961059192031E-2,4.2506590594763735E-2]
[null,null,null,80,3.4253657898530699E-12,2.0269283554281681E-3,2.5068095851478082E-5,0.21458387169823431,2.480375586834462E-3,3.0035514509937359E-2,4.216777203362447E-2]

{"sheet":"Large Plot","index":1,"n_rows":0,"n_cols":0,"rows_kept":0,"cut":false,"hidden":false,"merged":[]}

{"sheet":"Sheet3","index":2,"n_rows":0,"n_cols":0,"rows_kept":0,"cut":false,"hidden":false,"merged":[]}